Bug 151050

Summary: krb5 isn't rebuildable against Rawhide
Product: [Fedora] Fedora Reporter: Robert Scheck <redhat-bugzilla>
Component: krb5Assignee: Nalin Dahyabhai <nalin>
Status: CLOSED RAWHIDE QA Contact: Brian Brock <bbrock>
Severity: medium Docs Contact:
Priority: medium    
Version: rawhide   
Target Milestone: ---   
Target Release: ---   
Hardware: All   
OS: Linux   
Whiteboard:
Fixed In Version: 1.4-2 Doc Type: Bug Fix
Doc Text:
Story Points: ---
Clone Of: Environment:
Last Closed: 2005-03-17 08:40:40 EST Type: ---
Regression: --- Mount Type: ---
Documentation: --- CRM:
Verified Versions: Category: ---
oVirt Team: --- RHEL 7.3 requirements from Atomic Host:
Cloudforms Team: ---

Description Robert Scheck 2005-03-14 08:58:22 EST
Description of problem:
krb5 isn't rebuildable against Rawhide, dies with this error:

--- snipp ---
gcc -DPACKAGE_NAME=\"\" -DPACKAGE_TARNAME=\"\" -DPACKAGE_VERSION=\"\" -
DPACKAGE_STRING=\"\" -DPACKAGE_BUGREPORT=\"\" -DKRB5_KRB4_COMPAT=1 -
DHAVE_BT_RSEQ=1 -DKRB5_PRIVATE=1 -DKRB5_DEPRECATED=1 -DKRB5_DNS_LOOKUP_KDC=1 -
DKRB5_DNS_LOOKUP=1 -DHAVE_PRAGMA_WEAK_REF=1 -DDELAY_INITIALIZER=1 -
DCONSTRUCTOR_ATTR_WORKS=1 -DDESTRUCTOR_ATTR_WORKS=1 -DENABLE_THREADS=1 -
DHAVE_PTHREAD=1 -DHAVE_PTHREAD_RWLOCK_INIT_IN_THREAD_LIB=1 -DHAVE_STRCASECMP=1 
-DHAVE_STRDUP=1 -DHAVE_SETSID=1 -DHAVE_STRERROR=1 -DHAVE_STRFTIME=1 -
DHAVE_GETOPT=1 -DHAVE_HERROR=1 -DHAVE_SETENV=1 -DHAVE_UNSETENV=1 -DHAVE_GETENV=
1 -DHAVE_VSNPRINTF=1 -DSTDC_HEADERS=1 -DHAVE_SYS_TYPES_H=1 -DHAVE_SYS_STAT_H=1 
-DHAVE_STDLIB_H=1 -DHAVE_STRING_H=1 -DHAVE_MEMORY_H=1 -DHAVE_STRINGS_H=1 -
DHAVE_INTTYPES_H=1 -DHAVE_STDINT_H=1 -DHAVE_UNISTD_H=1 -DHAVE_STDLIB_H=1 -
DHAVE_STRING_H=1 -DHAVE_UNISTD_H=1 -DHAVE_ARPA_NAMESER_H=1 -DHAVE_SYS_SELECT_H=
1 -DHAVE_ARPA_INET_H=1 -DHAVE_CURSES_H=1 -DHAVE_UTMP_H=1 -DHAVE_SYS_TIME_H=1 -
DHAVE_SYS_UTSNAME_H=1 -DHAVE_MEMORY_H=1 -DKRB4=1 -DHAVE_UNISTD_H=1 -DHAVE_FORK=
1 -DHAVE_VFORK=1 -DHAVE_WORKING_VFORK=1 -DHAVE_WORKING_FORK=1 -DHAVE_STDARG_H=1 
-DHAVE_TERM_H=1 -DTERMCAP=1 -DHAVE_STRUCT_SOCKADDR_STORAGE=1 -
DHAVE_SYS_TYPES_H=1 -DHAVE_SYS_SOCKET_H=1 -DHAVE_NETINET_IN_H=1 -DHAVE_NETDB_H=
1 -DHAVE_INET_NTOP=1 -DHAVE_INET_PTON=1 -DHAVE_GETNAMEINFO=1 -
DHAVE_GETADDRINFO=1 -DKRB5_USE_INET6=1 -DUSE_TERMIO=1 -DNEED_PARSETOS_PROTO=1 -
DPOSIX_SIGNALS=1 -DKRB4=1 -DHAVE_REGCOMP=1 -DTERMCAP=1 -DTIME_WITH_SYS_TIME=1 -
DHAVE_LIBUTIL=1  -DAUTHENTICATION -DENCRYPTION -DKRB5 -DFORWARD -UNO_LOGIN_F -
DLOGIN_CAP_F -DLOGIN_PROGRAM=KRB5_PATH_LOGIN -DLINEMODE -DKLUDGELINEMODE -
DDIAGNOSTICS -DENV_HACK -DOLD_ENVIRON -I../../../include -I./../../../include -
I../../../include/krb5 -I./../../../include/krb5 -I.. -I./.. -
D_FILE_OFFSET_BITS=64 -I/usr/include/et -O2 -Wall -g -pipe -Wp,-
D_FORTIFY_SOURCE=2 -m32 -march=i386 -mtune=pentium4 -D_FILE_OFFSET_BITS=64 -
I/usr/include/et -fPIC -pthread -c telnet.c
telnet.c:165: warning: missing braces around initializer
telnet.c:165: warning: (near initialization for 'toplevel[0]')
telnet.c:780: error: static declaration of 'setupterm' follows non-static declaration
/usr/include/term.h:758: error: previous declaration of 'setupterm' was here
make[3]: *** [telnet.o] Error 1
make[3]: Leaving directory `/usr/src/redhat/BUILD/krb5-1.4/src/appl/telnet/telnet'
make[2]: *** [all-recurse] Error 1
make[2]: Leaving directory `/usr/src/redhat/BUILD/krb5-1.4/src/appl/telnet'
make[1]: *** [all-recurse] Error 1
make[1]: Leaving directory `/usr/src/redhat/BUILD/krb5-1.4/src/appl'
make: *** [all-recurse] Error 1
Fehler: Bad exit status from /var/tmp/rpm-tmp.30257 (%build)
--- snapp ---

Version-Release number of selected component (if applicable):
krb5-1.4-1

How reproducible:
Everytime, try to rebuild krb5.

Actual results / Expected results:
Rebuildable krb5.
Comment 1 Robert Scheck 2005-03-17 08:40:40 EST
Fixed in 1.4-2, closing now.