Bug 2294349
| Summary: | perl-Graph-0.9735 is available | ||||||||||||||||||||
|---|---|---|---|---|---|---|---|---|---|---|---|---|---|---|---|---|---|---|---|---|---|
| Product: | [Fedora] Fedora | Reporter: | Upstream Release Monitoring <upstream-release-monitoring> | ||||||||||||||||||
| Component: | perl-Graph | Assignee: | Athos Ribeiro <athoscribeiro> | ||||||||||||||||||
| Status: | CLOSED ERRATA | QA Contact: | Fedora Extras Quality Assurance <extras-qa> | ||||||||||||||||||
| Severity: | unspecified | Docs Contact: | |||||||||||||||||||
| Priority: | unspecified | ||||||||||||||||||||
| Version: | rawhide | CC: | alex, athoscribeiro, igor.raits, jplesnik, perl-devel | ||||||||||||||||||
| Target Milestone: | --- | Keywords: | FutureFeature, Triaged | ||||||||||||||||||
| Target Release: | --- | ||||||||||||||||||||
| Hardware: | Unspecified | ||||||||||||||||||||
| OS: | Unspecified | ||||||||||||||||||||
| Whiteboard: | |||||||||||||||||||||
| Fixed In Version: | perl-Graph-0.97.35-1.fc43 | Doc Type: | --- | ||||||||||||||||||
| Doc Text: | Story Points: | --- | |||||||||||||||||||
| Clone Of: | Environment: | ||||||||||||||||||||
| Last Closed: | 2025-07-28 14:37:39 UTC | Type: | --- | ||||||||||||||||||
| Regression: | --- | Mount Type: | --- | ||||||||||||||||||
| Documentation: | --- | CRM: | |||||||||||||||||||
| Verified Versions: | Category: | --- | |||||||||||||||||||
| oVirt Team: | --- | RHEL 7.3 requirements from Atomic Host: | |||||||||||||||||||
| Cloudforms Team: | --- | Target Upstream Version: | |||||||||||||||||||
| Embargoed: | |||||||||||||||||||||
| Attachments: |
|
||||||||||||||||||||
|
Description
Upstream Release Monitoring
2024-06-26 00:39:15 UTC
Scratch build failed. Details below:
BuilderException: Build failed:
There is a syntax error in updated specfile. See attached diff for the changes.
Traceback:
File "/usr/local/lib/python3.12/site-packages/hotness/use_cases/package_scratch_build_use_case.py", line 56, in build
result = self.builder.build(request.package, request.opts)
^^^^^^^^^^^^^^^^^^^^^^^^^^^^^^^^^^^^^^^^^^^^^^^^^
File "/usr/local/lib/python3.12/site-packages/hotness/builders/koji.py", line 205, in build
raise BuilderException(str(exc), value=output)
If you think this issue is caused by some bug in the-new-hotness, please report it on the-new-hotness issue tracker: https://github.com/fedora-infra/the-new-hotness/issues
Created attachment 2038306 [details]
Update to 0.9728 (#2294349)
Releases retrieved: 0.9729 Upstream release that is considered latest: 0.9729 Current version/release in rawhide: 0.97.27-3.fc40 URL: https://metacpan.org/dist/Graph/ Please consult the package updates policy before you issue an update to a stable branch: https://docs.fedoraproject.org/en-US/fesco/Updates_Policy/ More information about the service that created this bug can be found at: https://docs.fedoraproject.org/en-US/package-maintainers/Upstream_Release_Monitoring Please keep in mind that with any upstream change, there may also be packaging changes that need to be made. Specifically, please remember that it is your responsibility to review the new version to ensure that the licensing is still correct and that no non-free or legally problematic items have been added upstream. Based on the information from Anitya: https://release-monitoring.org/project/7524/ To change the monitoring settings for the project, please visit: https://src.fedoraproject.org/rpms/perl-Graph Scratch build failed. Details below:
BuilderException: Build failed:
There is a syntax error in updated specfile. See attached diff for the changes.
Traceback:
File "/usr/local/lib/python3.12/site-packages/hotness/use_cases/package_scratch_build_use_case.py", line 56, in build
result = self.builder.build(request.package, request.opts)
^^^^^^^^^^^^^^^^^^^^^^^^^^^^^^^^^^^^^^^^^^^^^^^^^
File "/usr/local/lib/python3.12/site-packages/hotness/builders/koji.py", line 205, in build
raise BuilderException(str(exc), value=output)
If you think this issue is caused by some bug in the-new-hotness, please report it on the-new-hotness issue tracker: https://github.com/fedora-infra/the-new-hotness/issues
Created attachment 2038850 [details]
Update to 0.9729 (#2294349)
Releases retrieved: 0.9730 Upstream release that is considered latest: 0.9730 Current version/release in rawhide: 0.97.27-4.fc41 URL: https://metacpan.org/dist/Graph/ Please consult the package updates policy before you issue an update to a stable branch: https://docs.fedoraproject.org/en-US/fesco/Updates_Policy/ More information about the service that created this bug can be found at: https://docs.fedoraproject.org/en-US/package-maintainers/Upstream_Release_Monitoring Please keep in mind that with any upstream change, there may also be packaging changes that need to be made. Specifically, please remember that it is your responsibility to review the new version to ensure that the licensing is still correct and that no non-free or legally problematic items have been added upstream. Based on the information from Anitya: https://release-monitoring.org/project/7524/ To change the monitoring settings for the project, please visit: https://src.fedoraproject.org/rpms/perl-Graph Scratch build failed. Details below:
BuilderException: Build failed:
There is a syntax error in updated specfile. See attached diff for the changes.
Traceback:
File "/usr/local/lib/python3.12/site-packages/hotness/use_cases/package_scratch_build_use_case.py", line 56, in build
result = self.builder.build(request.package, request.opts)
^^^^^^^^^^^^^^^^^^^^^^^^^^^^^^^^^^^^^^^^^^^^^^^^^
File "/usr/local/lib/python3.12/site-packages/hotness/builders/koji.py", line 205, in build
raise BuilderException(str(exc), value=output)
If you think this issue is caused by some bug in the-new-hotness, please report it on the-new-hotness issue tracker: https://github.com/fedora-infra/the-new-hotness/issues
Created attachment 2044577 [details]
Update to 0.9730 (#2294349)
Releases retrieved: 0.9731 Upstream release that is considered latest: 0.9731 Current version/release in rawhide: 0.97.27-4.fc41 URL: https://metacpan.org/dist/Graph/ Please consult the package updates policy before you issue an update to a stable branch: https://docs.fedoraproject.org/en-US/fesco/Updates_Policy/ More information about the service that created this bug can be found at: https://docs.fedoraproject.org/en-US/package-maintainers/Upstream_Release_Monitoring Please keep in mind that with any upstream change, there may also be packaging changes that need to be made. Specifically, please remember that it is your responsibility to review the new version to ensure that the licensing is still correct and that no non-free or legally problematic items have been added upstream. Based on the information from Anitya: https://release-monitoring.org/project/7524/ To change the monitoring settings for the project, please visit: https://src.fedoraproject.org/rpms/perl-Graph Scratch build failed. Details below:
BuilderException: Build failed:
There is a syntax error in updated specfile. See attached diff for the changes.
Traceback:
File "/usr/local/lib/python3.12/site-packages/hotness/use_cases/package_scratch_build_use_case.py", line 56, in build
result = self.builder.build(request.package, request.opts)
^^^^^^^^^^^^^^^^^^^^^^^^^^^^^^^^^^^^^^^^^^^^^^^^^
File "/usr/local/lib/python3.12/site-packages/hotness/builders/koji.py", line 205, in build
raise BuilderException(str(exc), value=output)
If you think this issue is caused by some bug in the-new-hotness, please report it on the-new-hotness issue tracker: https://github.com/fedora-infra/the-new-hotness/issues
Created attachment 2044733 [details]
Update to 0.9731 (#2294349)
Releases retrieved: 0.9732 Upstream release that is considered latest: 0.9732 Current version/release in rawhide: 0.97.27-4.fc41 URL: https://metacpan.org/dist/Graph/ Please consult the package updates policy before you issue an update to a stable branch: https://docs.fedoraproject.org/en-US/fesco/Updates_Policy/ More information about the service that created this bug can be found at: https://docs.fedoraproject.org/en-US/package-maintainers/Upstream_Release_Monitoring Please keep in mind that with any upstream change, there may also be packaging changes that need to be made. Specifically, please remember that it is your responsibility to review the new version to ensure that the licensing is still correct and that no non-free or legally problematic items have been added upstream. Based on the information from Anitya: https://release-monitoring.org/project/7524/ To change the monitoring settings for the project, please visit: https://src.fedoraproject.org/rpms/perl-Graph Scratch build failed. Details below:
BuilderException: Build failed:
There is a syntax error in updated specfile. See attached diff for the changes.
Traceback:
File "/usr/local/lib/python3.12/site-packages/hotness/use_cases/package_scratch_build_use_case.py", line 56, in build
result = self.builder.build(request.package, request.opts)
^^^^^^^^^^^^^^^^^^^^^^^^^^^^^^^^^^^^^^^^^^^^^^^^^
File "/usr/local/lib/python3.12/site-packages/hotness/builders/koji.py", line 205, in build
raise BuilderException(str(exc), value=output)
If you think this issue is caused by some bug in the-new-hotness, please report it on the-new-hotness issue tracker: https://github.com/fedora-infra/the-new-hotness/issues
Created attachment 2045220 [details]
Update to 0.9732 (#2294349)
Releases retrieved: 0.9733 Upstream release that is considered latest: 0.9733 Current version/release in rawhide: 0.97.27-4.fc41 URL: https://metacpan.org/dist/Graph/ Please consult the package updates policy before you issue an update to a stable branch: https://docs.fedoraproject.org/en-US/fesco/Updates_Policy/ More information about the service that created this bug can be found at: https://docs.fedoraproject.org/en-US/package-maintainers/Upstream_Release_Monitoring Please keep in mind that with any upstream change, there may also be packaging changes that need to be made. Specifically, please remember that it is your responsibility to review the new version to ensure that the licensing is still correct and that no non-free or legally problematic items have been added upstream. Based on the information from Anitya: https://release-monitoring.org/project/7524/ To change the monitoring settings for the project, please visit: https://src.fedoraproject.org/rpms/perl-Graph Scratch build failed. Details below:
BuilderException: Build failed:
There is a syntax error in updated specfile. See attached diff for the changes.
Traceback:
File "/usr/local/lib/python3.12/site-packages/hotness/use_cases/package_scratch_build_use_case.py", line 56, in build
result = self.builder.build(request.package, request.opts)
^^^^^^^^^^^^^^^^^^^^^^^^^^^^^^^^^^^^^^^^^^^^^^^^^
File "/usr/local/lib/python3.12/site-packages/hotness/builders/koji.py", line 205, in build
raise BuilderException(str(exc), value=output)
If you think this issue is caused by some bug in the-new-hotness, please report it on the-new-hotness issue tracker: https://github.com/fedora-infra/the-new-hotness/issues
Created attachment 2065749 [details]
Update to 0.9733 (#2294349)
Releases retrieved: 0.9734 Upstream release that is considered latest: 0.9734 Current version/release in rawhide: 0.97.27-5.fc42 URL: https://metacpan.org/dist/Graph/ Please consult the package updates policy before you issue an update to a stable branch: https://docs.fedoraproject.org/en-US/fesco/Updates_Policy/ More information about the service that created this bug can be found at: https://docs.fedoraproject.org/en-US/package-maintainers/Upstream_Release_Monitoring Please keep in mind that with any upstream change, there may also be packaging changes that need to be made. Specifically, please remember that it is your responsibility to review the new version to ensure that the licensing is still correct and that no non-free or legally problematic items have been added upstream. Based on the information from Anitya: https://release-monitoring.org/project/7524/ To change the monitoring settings for the project, please visit: https://src.fedoraproject.org/rpms/perl-Graph Scratch build failed. Details below:
BuilderException: Build failed:
There is a syntax error in updated specfile. See attached diff for the changes.
Traceback:
File "/usr/local/lib/python3.12/site-packages/hotness/use_cases/package_scratch_build_use_case.py", line 56, in build
result = self.builder.build(request.package, request.opts)
^^^^^^^^^^^^^^^^^^^^^^^^^^^^^^^^^^^^^^^^^^^^^^^^^
File "/usr/local/lib/python3.12/site-packages/hotness/builders/koji.py", line 205, in build
raise BuilderException(str(exc), value=output)
If you think this issue is caused by some bug in the-new-hotness, please report it on the-new-hotness issue tracker: https://github.com/fedora-infra/the-new-hotness/issues
Created attachment 2078507 [details]
Update to 0.9734 (#2294349)
Releases retrieved: 0.9735 Upstream release that is considered latest: 0.9735 Current version/release in rawhide: 0.97.27-5.fc42 URL: https://metacpan.org/dist/Graph/ Please consult the package updates policy before you issue an update to a stable branch: https://docs.fedoraproject.org/en-US/fesco/Updates_Policy/ More information about the service that created this bug can be found at: https://docs.fedoraproject.org/en-US/package-maintainers/Upstream_Release_Monitoring Please keep in mind that with any upstream change, there may also be packaging changes that need to be made. Specifically, please remember that it is your responsibility to review the new version to ensure that the licensing is still correct and that no non-free or legally problematic items have been added upstream. Based on the information from Anitya: https://release-monitoring.org/project/7524/ To change the monitoring settings for the project, please visit: https://src.fedoraproject.org/rpms/perl-Graph Scratch build failed. Details below:
BuilderException: Build failed:
There is a syntax error in updated specfile. See attached diff for the changes.
Traceback:
File "/usr/local/lib/python3.12/site-packages/hotness/use_cases/package_scratch_build_use_case.py", line 56, in build
result = self.builder.build(request.package, request.opts)
^^^^^^^^^^^^^^^^^^^^^^^^^^^^^^^^^^^^^^^^^^^^^^^^^
File "/usr/local/lib/python3.12/site-packages/hotness/builders/koji.py", line 205, in build
raise BuilderException(str(exc), value=output)
If you think this issue is caused by some bug in the-new-hotness, please report it on the-new-hotness issue tracker: https://github.com/fedora-infra/the-new-hotness/issues
Created attachment 2082306 [details]
Update to 0.9735 (#2294349)
FEDORA-2025-58f875646f (perl-Graph-0.97.35-1.fc43) has been submitted as an update to Fedora 43. https://bodhi.fedoraproject.org/updates/FEDORA-2025-58f875646f FEDORA-2025-58f875646f (perl-Graph-0.97.35-1.fc43) has been pushed to the Fedora 43 stable repository. If problem still persists, please make note of it in this bug report. |