Bug 2326722
| Summary: | mingw-vulkan-validation-layers-1.4.304 is available | ||||||||||||||||||||||||||||
|---|---|---|---|---|---|---|---|---|---|---|---|---|---|---|---|---|---|---|---|---|---|---|---|---|---|---|---|---|---|
| Product: | [Fedora] Fedora | Reporter: | Upstream Release Monitoring <upstream-release-monitoring> | ||||||||||||||||||||||||||
| Component: | mingw-vulkan-validation-layers | Assignee: | Sandro Mani <manisandro> | ||||||||||||||||||||||||||
| Status: | CLOSED ERRATA | QA Contact: | Fedora Extras Quality Assurance <extras-qa> | ||||||||||||||||||||||||||
| Severity: | unspecified | Docs Contact: | |||||||||||||||||||||||||||
| Priority: | unspecified | ||||||||||||||||||||||||||||
| Version: | rawhide | CC: | manisandro | ||||||||||||||||||||||||||
| Target Milestone: | --- | Keywords: | FutureFeature, Triaged | ||||||||||||||||||||||||||
| Target Release: | --- | ||||||||||||||||||||||||||||
| Hardware: | Unspecified | ||||||||||||||||||||||||||||
| OS: | Unspecified | ||||||||||||||||||||||||||||
| Whiteboard: | |||||||||||||||||||||||||||||
| Fixed In Version: | mingw-vulkan-validation-layers-1.4.304.0-1.fc42 | Doc Type: | --- | ||||||||||||||||||||||||||
| Doc Text: | Story Points: | --- | |||||||||||||||||||||||||||
| Clone Of: | Environment: | ||||||||||||||||||||||||||||
| Last Closed: | 2025-01-15 14:13:59 UTC | Type: | --- | ||||||||||||||||||||||||||
| Regression: | --- | Mount Type: | --- | ||||||||||||||||||||||||||
| Documentation: | --- | CRM: | |||||||||||||||||||||||||||
| Verified Versions: | Category: | --- | |||||||||||||||||||||||||||
| oVirt Team: | --- | RHEL 7.3 requirements from Atomic Host: | |||||||||||||||||||||||||||
| Cloudforms Team: | --- | Target Upstream Version: | |||||||||||||||||||||||||||
| Embargoed: | |||||||||||||||||||||||||||||
| Attachments: |
|
||||||||||||||||||||||||||||
|
Description
Upstream Release Monitoring
2024-11-17 02:51:36 UTC
Scratch build failed. Details below:
BuilderException: Build failed:
Command '['rpmbuild', '-D', '_sourcedir .', '-D', '_topdir .', '-bs', '/var/tmp/thn-n6zmeljc/mingw-vulkan-validation-layers.spec']' returned non-zero exit status 1.
StdOut:
setting SOURCE_DATE_EPOCH=1731801600
error: Bad file: ./Vulkan-ValidationLayers-1.3.301.tar.gz: No such file or directory
RPM build errors:
Bad file: ./Vulkan-ValidationLayers-1.3.301.tar.gz: No such file or directory
Traceback:
File "/usr/local/lib/python3.12/site-packages/hotness/use_cases/package_scratch_build_use_case.py", line 56, in build
result = self.builder.build(request.package, request.opts)
^^^^^^^^^^^^^^^^^^^^^^^^^^^^^^^^^^^^^^^^^^^^^^^^^
File "/usr/local/lib/python3.12/site-packages/hotness/builders/koji.py", line 229, in build
raise BuilderException(
If you think this issue is caused by some bug in the-new-hotness, please report it on the-new-hotness issue tracker: https://github.com/fedora-infra/the-new-hotness/issues
Created attachment 2058190 [details]
Update to 1.3.301 (#2326722)
Releases retrieved: 1.3.302 Upstream release that is considered latest: 1.3.302 Current version/release in rawhide: 1.3.296.0-1.fc42 URL: https://github.com/KhronosGroup/Vulkan-ValidationLayers Please consult the package updates policy before you issue an update to a stable branch: https://docs.fedoraproject.org/en-US/fesco/Updates_Policy/ More information about the service that created this bug can be found at: https://docs.fedoraproject.org/en-US/package-maintainers/Upstream_Release_Monitoring Please keep in mind that with any upstream change, there may also be packaging changes that need to be made. Specifically, please remember that it is your responsibility to review the new version to ensure that the licensing is still correct and that no non-free or legally problematic items have been added upstream. Based on the information from Anitya: https://release-monitoring.org/project/328196/ To change the monitoring settings for the project, please visit: https://src.fedoraproject.org/rpms/mingw-vulkan-validation-layers Scratch build failed. Details below:
BuilderException: Build failed:
Command '['rpmbuild', '-D', '_sourcedir .', '-D', '_topdir .', '-bs', '/var/tmp/thn-v3bzbbjl/mingw-vulkan-validation-layers.spec']' returned non-zero exit status 1.
StdOut:
setting SOURCE_DATE_EPOCH=1732147200
error: Bad file: ./Vulkan-ValidationLayers-1.3.302.tar.gz: No such file or directory
RPM build errors:
Bad file: ./Vulkan-ValidationLayers-1.3.302.tar.gz: No such file or directory
Traceback:
File "/usr/local/lib/python3.12/site-packages/hotness/use_cases/package_scratch_build_use_case.py", line 56, in build
result = self.builder.build(request.package, request.opts)
^^^^^^^^^^^^^^^^^^^^^^^^^^^^^^^^^^^^^^^^^^^^^^^^^
File "/usr/local/lib/python3.12/site-packages/hotness/builders/koji.py", line 229, in build
raise BuilderException(
If you think this issue is caused by some bug in the-new-hotness, please report it on the-new-hotness issue tracker: https://github.com/fedora-infra/the-new-hotness/issues
Created attachment 2059205 [details]
Update to 1.3.302 (#2326722)
Scratch build failed. Details below:
BuilderException: Build failed:
Command '['rpmbuild', '-D', '_sourcedir .', '-D', '_topdir .', '-bs', '/var/tmp/thn-t4fuoj6t/mingw-vulkan-validation-layers.spec']' returned non-zero exit status 1.
StdOut:
setting SOURCE_DATE_EPOCH=1732406400
error: Bad file: ./Vulkan-ValidationLayers-1.3.302.tar.gz: No such file or directory
RPM build errors:
Bad file: ./Vulkan-ValidationLayers-1.3.302.tar.gz: No such file or directory
Traceback:
File "/usr/local/lib/python3.12/site-packages/hotness/use_cases/package_scratch_build_use_case.py", line 56, in build
result = self.builder.build(request.package, request.opts)
^^^^^^^^^^^^^^^^^^^^^^^^^^^^^^^^^^^^^^^^^^^^^^^^^
File "/usr/local/lib/python3.12/site-packages/hotness/builders/koji.py", line 229, in build
raise BuilderException(
If you think this issue is caused by some bug in the-new-hotness, please report it on the-new-hotness issue tracker: https://github.com/fedora-infra/the-new-hotness/issues
Created attachment 2059579 [details]
Update to 1.3.302 (#2326722)
Scratch build failed. Details below:
BuilderException: Build failed:
Command '['rpmbuild', '-D', '_sourcedir .', '-D', '_topdir .', '-bs', '/var/tmp/thn-hmshs2b7/mingw-vulkan-validation-layers.spec']' returned non-zero exit status 1.
StdOut:
setting SOURCE_DATE_EPOCH=1733011200
error: Bad file: ./Vulkan-ValidationLayers-1.3.302.tar.gz: No such file or directory
RPM build errors:
Bad file: ./Vulkan-ValidationLayers-1.3.302.tar.gz: No such file or directory
Traceback:
File "/usr/local/lib/python3.12/site-packages/hotness/use_cases/package_scratch_build_use_case.py", line 56, in build
result = self.builder.build(request.package, request.opts)
^^^^^^^^^^^^^^^^^^^^^^^^^^^^^^^^^^^^^^^^^^^^^^^^^
File "/usr/local/lib/python3.12/site-packages/hotness/builders/koji.py", line 229, in build
raise BuilderException(
If you think this issue is caused by some bug in the-new-hotness, please report it on the-new-hotness issue tracker: https://github.com/fedora-infra/the-new-hotness/issues
Created attachment 2060555 [details]
Update to 1.3.302 (#2326722)
Scratch build failed. Details below:
BuilderException: Build failed:
Command '['rpmbuild', '-D', '_sourcedir .', '-D', '_topdir .', '-bs', '/var/tmp/thn-q3flxf5p/mingw-vulkan-validation-layers.spec']' returned non-zero exit status 1.
StdOut:
setting SOURCE_DATE_EPOCH=1733616000
error: Bad file: ./Vulkan-ValidationLayers-1.3.302.tar.gz: No such file or directory
RPM build errors:
Bad file: ./Vulkan-ValidationLayers-1.3.302.tar.gz: No such file or directory
Traceback:
File "/usr/local/lib/python3.12/site-packages/hotness/use_cases/package_scratch_build_use_case.py", line 56, in build
result = self.builder.build(request.package, request.opts)
^^^^^^^^^^^^^^^^^^^^^^^^^^^^^^^^^^^^^^^^^^^^^^^^^
File "/usr/local/lib/python3.12/site-packages/hotness/builders/koji.py", line 229, in build
raise BuilderException(
If you think this issue is caused by some bug in the-new-hotness, please report it on the-new-hotness issue tracker: https://github.com/fedora-infra/the-new-hotness/issues
Created attachment 2061599 [details]
Update to 1.3.302 (#2326722)
Scratch build failed. Details below:
BuilderException: Build failed:
Command '['rpmbuild', '-D', '_sourcedir .', '-D', '_topdir .', '-bs', '/var/tmp/thn-hfv7b69c/mingw-vulkan-validation-layers.spec']' returned non-zero exit status 1.
StdOut:
setting SOURCE_DATE_EPOCH=1734220800
error: Bad file: ./Vulkan-ValidationLayers-1.3.302.tar.gz: No such file or directory
RPM build errors:
Bad file: ./Vulkan-ValidationLayers-1.3.302.tar.gz: No such file or directory
Traceback:
File "/usr/local/lib/python3.12/site-packages/hotness/use_cases/package_scratch_build_use_case.py", line 56, in build
result = self.builder.build(request.package, request.opts)
^^^^^^^^^^^^^^^^^^^^^^^^^^^^^^^^^^^^^^^^^^^^^^^^^
File "/usr/local/lib/python3.12/site-packages/hotness/builders/koji.py", line 229, in build
raise BuilderException(
If you think this issue is caused by some bug in the-new-hotness, please report it on the-new-hotness issue tracker: https://github.com/fedora-infra/the-new-hotness/issues
Created attachment 2062527 [details]
Update to 1.3.302 (#2326722)
Releases retrieved: 1.4.304 Upstream release that is considered latest: 1.4.304 Current version/release in rawhide: 1.3.296.0-1.fc42 URL: https://github.com/KhronosGroup/Vulkan-ValidationLayers Please consult the package updates policy before you issue an update to a stable branch: https://docs.fedoraproject.org/en-US/fesco/Updates_Policy/ More information about the service that created this bug can be found at: https://docs.fedoraproject.org/en-US/package-maintainers/Upstream_Release_Monitoring Please keep in mind that with any upstream change, there may also be packaging changes that need to be made. Specifically, please remember that it is your responsibility to review the new version to ensure that the licensing is still correct and that no non-free or legally problematic items have been added upstream. Based on the information from Anitya: https://release-monitoring.org/project/328196/ To change the monitoring settings for the project, please visit: https://src.fedoraproject.org/rpms/mingw-vulkan-validation-layers Scratch build failed. Details below:
BuilderException: Build failed:
Command '['rpmbuild', '-D', '_sourcedir .', '-D', '_topdir .', '-bs', '/var/tmp/thn-2vatyoyk/mingw-vulkan-validation-layers.spec']' returned non-zero exit status 1.
StdOut:
setting SOURCE_DATE_EPOCH=1734739200
error: Bad file: ./Vulkan-ValidationLayers-1.4.304.tar.gz: No such file or directory
RPM build errors:
Bad file: ./Vulkan-ValidationLayers-1.4.304.tar.gz: No such file or directory
Traceback:
File "/usr/local/lib/python3.12/site-packages/hotness/use_cases/package_scratch_build_use_case.py", line 56, in build
result = self.builder.build(request.package, request.opts)
^^^^^^^^^^^^^^^^^^^^^^^^^^^^^^^^^^^^^^^^^^^^^^^^^
File "/usr/local/lib/python3.12/site-packages/hotness/builders/koji.py", line 229, in build
raise BuilderException(
If you think this issue is caused by some bug in the-new-hotness, please report it on the-new-hotness issue tracker: https://github.com/fedora-infra/the-new-hotness/issues
Created attachment 2063403 [details]
Update to 1.4.304 (#2326722)
Scratch build failed. Details below:
BuilderException: Build failed:
Command '['rpmbuild', '-D', '_sourcedir .', '-D', '_topdir .', '-bs', '/var/tmp/thn-s6zwad5h/mingw-vulkan-validation-layers.spec']' returned non-zero exit status 1.
StdOut:
setting SOURCE_DATE_EPOCH=1734825600
error: Bad file: ./Vulkan-ValidationLayers-1.4.304.tar.gz: No such file or directory
RPM build errors:
Bad file: ./Vulkan-ValidationLayers-1.4.304.tar.gz: No such file or directory
Traceback:
File "/usr/local/lib/python3.12/site-packages/hotness/use_cases/package_scratch_build_use_case.py", line 56, in build
result = self.builder.build(request.package, request.opts)
^^^^^^^^^^^^^^^^^^^^^^^^^^^^^^^^^^^^^^^^^^^^^^^^^
File "/usr/local/lib/python3.12/site-packages/hotness/builders/koji.py", line 229, in build
raise BuilderException(
If you think this issue is caused by some bug in the-new-hotness, please report it on the-new-hotness issue tracker: https://github.com/fedora-infra/the-new-hotness/issues
Created attachment 2063485 [details]
Update to 1.4.304 (#2326722)
Scratch build failed. Details below:
BuilderException: Build failed:
Command '['rpmbuild', '-D', '_sourcedir .', '-D', '_topdir .', '-bs', '/var/tmp/thn-bflkn1xe/mingw-vulkan-validation-layers.spec']' returned non-zero exit status 1.
StdOut:
setting SOURCE_DATE_EPOCH=1735430400
error: Bad file: ./Vulkan-ValidationLayers-1.4.304.tar.gz: No such file or directory
RPM build errors:
Bad file: ./Vulkan-ValidationLayers-1.4.304.tar.gz: No such file or directory
Traceback:
File "/usr/local/lib/python3.12/site-packages/hotness/use_cases/package_scratch_build_use_case.py", line 56, in build
result = self.builder.build(request.package, request.opts)
^^^^^^^^^^^^^^^^^^^^^^^^^^^^^^^^^^^^^^^^^^^^^^^^^
File "/usr/local/lib/python3.12/site-packages/hotness/builders/koji.py", line 229, in build
raise BuilderException(
If you think this issue is caused by some bug in the-new-hotness, please report it on the-new-hotness issue tracker: https://github.com/fedora-infra/the-new-hotness/issues
Created attachment 2064112 [details]
Update to 1.4.304 (#2326722)
Scratch build failed. Details below:
BuilderException: Build failed:
Command '['rpmbuild', '-D', '_sourcedir .', '-D', '_topdir .', '-bs', '/var/tmp/thn-ligy680u/mingw-vulkan-validation-layers.spec']' returned non-zero exit status 1.
StdOut:
setting SOURCE_DATE_EPOCH=1736035200
error: Bad file: ./Vulkan-ValidationLayers-1.4.304.tar.gz: No such file or directory
RPM build errors:
Bad file: ./Vulkan-ValidationLayers-1.4.304.tar.gz: No such file or directory
Traceback:
File "/usr/local/lib/python3.12/site-packages/hotness/use_cases/package_scratch_build_use_case.py", line 56, in build
result = self.builder.build(request.package, request.opts)
^^^^^^^^^^^^^^^^^^^^^^^^^^^^^^^^^^^^^^^^^^^^^^^^^
File "/usr/local/lib/python3.12/site-packages/hotness/builders/koji.py", line 229, in build
raise BuilderException(
If you think this issue is caused by some bug in the-new-hotness, please report it on the-new-hotness issue tracker: https://github.com/fedora-infra/the-new-hotness/issues
Created attachment 2064724 [details]
Update to 1.4.304 (#2326722)
Created attachment 2065602 [details]
Update to 1.4.304 (#2326722)
the-new-hotness/release-monitoring.org's scratch build of mingw-vulkan-validation-layers-1.4.304-1.fc40.src.rpm for rawhide failed http://koji.fedoraproject.org/koji/taskinfo?taskID=127781555 Created attachment 2065867 [details]
Update to 1.4.304 (#2326722)
the-new-hotness/release-monitoring.org's scratch build of mingw-vulkan-validation-layers-1.4.304-1.fc40.src.rpm for rawhide failed http://koji.fedoraproject.org/koji/taskinfo?taskID=127838863 FEDORA-2025-2f20f2a277 (mingw-glslang-1.4.304.0-1.fc42, mingw-spirv-headers-1.4.304.0-1.fc42, and 6 more) has been submitted as an update to Fedora 42. https://bodhi.fedoraproject.org/updates/FEDORA-2025-2f20f2a277 FEDORA-2025-2f20f2a277 (mingw-glslang-1.4.304.0-1.fc42, mingw-spirv-headers-1.4.304.0-1.fc42, and 6 more) has been pushed to the Fedora 42 stable repository. If problem still persists, please make note of it in this bug report. |