Bug 2332374
| Summary: | scipy-1.16.2 is available | ||||||||||||||||||||||||
|---|---|---|---|---|---|---|---|---|---|---|---|---|---|---|---|---|---|---|---|---|---|---|---|---|---|
| Product: | [Fedora] Fedora | Reporter: | Upstream Release Monitoring <upstream-release-monitoring> | ||||||||||||||||||||||
| Component: | scipy | Assignee: | Nikola Forró <nforro> | ||||||||||||||||||||||
| Status: | CLOSED ERRATA | QA Contact: | Fedora Extras Quality Assurance <extras-qa> | ||||||||||||||||||||||
| Severity: | unspecified | Docs Contact: | |||||||||||||||||||||||
| Priority: | unspecified | ||||||||||||||||||||||||
| Version: | rawhide | CC: | cstratak, david08741, mmuzila, nforro, psimovec, python-packagers-sig | ||||||||||||||||||||||
| Target Milestone: | --- | Keywords: | FutureFeature, Triaged | ||||||||||||||||||||||
| Target Release: | --- | ||||||||||||||||||||||||
| Hardware: | Unspecified | ||||||||||||||||||||||||
| OS: | Unspecified | ||||||||||||||||||||||||
| Whiteboard: | |||||||||||||||||||||||||
| Fixed In Version: | scipy-1.16.2-1.fc43 | Doc Type: | --- | ||||||||||||||||||||||
| Doc Text: | Story Points: | --- | |||||||||||||||||||||||
| Clone Of: | Environment: | ||||||||||||||||||||||||
| Last Closed: | 2025-10-07 13:54:55 UTC | Type: | --- | ||||||||||||||||||||||
| Regression: | --- | Mount Type: | --- | ||||||||||||||||||||||
| Documentation: | --- | CRM: | |||||||||||||||||||||||
| Verified Versions: | Category: | --- | |||||||||||||||||||||||
| oVirt Team: | --- | RHEL 7.3 requirements from Atomic Host: | |||||||||||||||||||||||
| Cloudforms Team: | --- | Target Upstream Version: | |||||||||||||||||||||||
| Embargoed: | |||||||||||||||||||||||||
| Bug Depends On: | |||||||||||||||||||||||||
| Bug Blocks: | 2383232 | ||||||||||||||||||||||||
| Attachments: |
|
||||||||||||||||||||||||
|
Description
Upstream Release Monitoring
2024-12-14 02:53:39 UTC
Scratch build failed. Details below:
BuilderException: Build failed:
There is a syntax error in updated specfile. See attached diff for the changes.
Traceback:
File "/usr/local/lib/python3.12/site-packages/hotness/use_cases/package_scratch_build_use_case.py", line 56, in build
result = self.builder.build(request.package, request.opts)
^^^^^^^^^^^^^^^^^^^^^^^^^^^^^^^^^^^^^^^^^^^^^^^^^
File "/usr/local/lib/python3.12/site-packages/hotness/builders/koji.py", line 205, in build
raise BuilderException(str(exc), value=output)
If you think this issue is caused by some bug in the-new-hotness, please report it on the-new-hotness issue tracker: https://github.com/fedora-infra/the-new-hotness/issues
Created attachment 2062396 [details]
Update to 1.15.0rc1 (#2332374)
Releases retrieved: 1.15.0rc2 Upstream release that is considered latest: 1.15.0rc2 Current version/release in rawhide: 1.14.1-2.fc42 URL: https://pypi.org/project/scipy Please consult the package updates policy before you issue an update to a stable branch: https://docs.fedoraproject.org/en-US/fesco/Updates_Policy/ More information about the service that created this bug can be found at: https://docs.fedoraproject.org/en-US/package-maintainers/Upstream_Release_Monitoring Please keep in mind that with any upstream change, there may also be packaging changes that need to be made. Specifically, please remember that it is your responsibility to review the new version to ensure that the licensing is still correct and that no non-free or legally problematic items have been added upstream. Based on the information from Anitya: https://release-monitoring.org/project/4768/ To change the monitoring settings for the project, please visit: https://src.fedoraproject.org/rpms/scipy Scratch build failed. Details below:
BuilderException: Build failed:
There is a syntax error in updated specfile. See attached diff for the changes.
Traceback:
File "/usr/local/lib/python3.12/site-packages/hotness/use_cases/package_scratch_build_use_case.py", line 56, in build
result = self.builder.build(request.package, request.opts)
^^^^^^^^^^^^^^^^^^^^^^^^^^^^^^^^^^^^^^^^^^^^^^^^^
File "/usr/local/lib/python3.12/site-packages/hotness/builders/koji.py", line 205, in build
raise BuilderException(str(exc), value=output)
If you think this issue is caused by some bug in the-new-hotness, please report it on the-new-hotness issue tracker: https://github.com/fedora-infra/the-new-hotness/issues
Created attachment 2063735 [details]
Update to 1.15.0rc2 (#2332374)
Releases retrieved: 1.15.0 Upstream release that is considered latest: 1.15.0 Current version/release in rawhide: 1.14.1-2.fc42 URL: https://pypi.org/project/scipy Please consult the package updates policy before you issue an update to a stable branch: https://docs.fedoraproject.org/en-US/fesco/Updates_Policy/ More information about the service that created this bug can be found at: https://docs.fedoraproject.org/en-US/package-maintainers/Upstream_Release_Monitoring Please keep in mind that with any upstream change, there may also be packaging changes that need to be made. Specifically, please remember that it is your responsibility to review the new version to ensure that the licensing is still correct and that no non-free or legally problematic items have been added upstream. Based on the information from Anitya: https://release-monitoring.org/project/4768/ To change the monitoring settings for the project, please visit: https://src.fedoraproject.org/rpms/scipy Scratch build failed. Details below:
BuilderException: Build failed:
There is a syntax error in updated specfile. See attached diff for the changes.
Traceback:
File "/usr/local/lib/python3.12/site-packages/hotness/use_cases/package_scratch_build_use_case.py", line 56, in build
result = self.builder.build(request.package, request.opts)
^^^^^^^^^^^^^^^^^^^^^^^^^^^^^^^^^^^^^^^^^^^^^^^^^
File "/usr/local/lib/python3.12/site-packages/hotness/builders/koji.py", line 205, in build
raise BuilderException(str(exc), value=output)
If you think this issue is caused by some bug in the-new-hotness, please report it on the-new-hotness issue tracker: https://github.com/fedora-infra/the-new-hotness/issues
Created attachment 2064587 [details]
Update to 1.15.0 (#2332374)
Releases retrieved: 1.15.1 Upstream release that is considered latest: 1.15.1 Current version/release in rawhide: 1.14.1-2.fc42 URL: https://pypi.org/project/scipy Please consult the package updates policy before you issue an update to a stable branch: https://docs.fedoraproject.org/en-US/fesco/Updates_Policy/ More information about the service that created this bug can be found at: https://docs.fedoraproject.org/en-US/package-maintainers/Upstream_Release_Monitoring Please keep in mind that with any upstream change, there may also be packaging changes that need to be made. Specifically, please remember that it is your responsibility to review the new version to ensure that the licensing is still correct and that no non-free or legally problematic items have been added upstream. Based on the information from Anitya: https://release-monitoring.org/project/4768/ To change the monitoring settings for the project, please visit: https://src.fedoraproject.org/rpms/scipy Scratch build failed. Details below:
BuilderException: Build failed:
There is a syntax error in updated specfile. See attached diff for the changes.
Traceback:
File "/usr/local/lib/python3.12/site-packages/hotness/use_cases/package_scratch_build_use_case.py", line 56, in build
result = self.builder.build(request.package, request.opts)
^^^^^^^^^^^^^^^^^^^^^^^^^^^^^^^^^^^^^^^^^^^^^^^^^
File "/usr/local/lib/python3.12/site-packages/hotness/builders/koji.py", line 205, in build
raise BuilderException(str(exc), value=output)
If you think this issue is caused by some bug in the-new-hotness, please report it on the-new-hotness issue tracker: https://github.com/fedora-infra/the-new-hotness/issues
Created attachment 2065445 [details]
Update to 1.15.1 (#2332374)
Releases retrieved: 1.15.2 Upstream release that is considered latest: 1.15.2 Current version/release in rawhide: 1.14.1-3.fc42 URL: https://pypi.org/project/scipy Please consult the package updates policy before you issue an update to a stable branch: https://docs.fedoraproject.org/en-US/fesco/Updates_Policy/ More information about the service that created this bug can be found at: https://docs.fedoraproject.org/en-US/package-maintainers/Upstream_Release_Monitoring Please keep in mind that with any upstream change, there may also be packaging changes that need to be made. Specifically, please remember that it is your responsibility to review the new version to ensure that the licensing is still correct and that no non-free or legally problematic items have been added upstream. Based on the information from Anitya: https://release-monitoring.org/project/4768/ To change the monitoring settings for the project, please visit: https://src.fedoraproject.org/rpms/scipy Scratch build failed. Details below:
BuilderException: Build failed:
There is a syntax error in updated specfile. See attached diff for the changes.
Traceback:
File "/usr/local/lib/python3.12/site-packages/hotness/use_cases/package_scratch_build_use_case.py", line 56, in build
result = self.builder.build(request.package, request.opts)
^^^^^^^^^^^^^^^^^^^^^^^^^^^^^^^^^^^^^^^^^^^^^^^^^
File "/usr/local/lib/python3.12/site-packages/hotness/builders/koji.py", line 205, in build
raise BuilderException(str(exc), value=output)
If you think this issue is caused by some bug in the-new-hotness, please report it on the-new-hotness issue tracker: https://github.com/fedora-infra/the-new-hotness/issues
Created attachment 2076804 [details]
Update to 1.15.2 (#2332374)
Releases retrieved: 1.15.3 Upstream release that is considered latest: 1.15.3 Current version/release in rawhide: 1.14.1-3.fc42 URL: https://pypi.org/project/scipy Please consult the package updates policy before you issue an update to a stable branch: https://docs.fedoraproject.org/en-US/fesco/Updates_Policy/ More information about the service that created this bug can be found at: https://docs.fedoraproject.org/en-US/package-maintainers/Upstream_Release_Monitoring Please keep in mind that with any upstream change, there may also be packaging changes that need to be made. Specifically, please remember that it is your responsibility to review the new version to ensure that the licensing is still correct and that no non-free or legally problematic items have been added upstream. Based on the information from Anitya: https://release-monitoring.org/project/4768/ To change the monitoring settings for the project, please visit: https://src.fedoraproject.org/rpms/scipy Scratch build failed. Details below:
BuilderException: Build failed:
There is a syntax error in updated specfile. See attached diff for the changes.
Traceback:
File "/usr/local/lib/python3.12/site-packages/hotness/use_cases/package_scratch_build_use_case.py", line 56, in build
result = self.builder.build(request.package, request.opts)
^^^^^^^^^^^^^^^^^^^^^^^^^^^^^^^^^^^^^^^^^^^^^^^^^
File "/usr/local/lib/python3.12/site-packages/hotness/builders/koji.py", line 205, in build
raise BuilderException(str(exc), value=output)
If you think this issue is caused by some bug in the-new-hotness, please report it on the-new-hotness issue tracker: https://github.com/fedora-infra/the-new-hotness/issues
Created attachment 2089145 [details]
Update to 1.15.3 (#2332374)
Releases retrieved: 1.16.0rc1 Upstream release that is considered latest: 1.16.0rc1 Current version/release in rawhide: 1.14.1-3.fc42 URL: https://pypi.org/project/scipy Please consult the package updates policy before you issue an update to a stable branch: https://docs.fedoraproject.org/en-US/fesco/Updates_Policy/ More information about the service that created this bug can be found at: https://docs.fedoraproject.org/en-US/package-maintainers/Upstream_Release_Monitoring Please keep in mind that with any upstream change, there may also be packaging changes that need to be made. Specifically, please remember that it is your responsibility to review the new version to ensure that the licensing is still correct and that no non-free or legally problematic items have been added upstream. Based on the information from Anitya: https://release-monitoring.org/project/4768/ To change the monitoring settings for the project, please visit: https://src.fedoraproject.org/rpms/scipy Scratch build failed. Details below:
BuilderException: Build failed:
There is a syntax error in updated specfile. See attached diff for the changes.
Traceback:
File "/usr/local/lib/python3.12/site-packages/hotness/use_cases/package_scratch_build_use_case.py", line 56, in build
result = self.builder.build(request.package, request.opts)
^^^^^^^^^^^^^^^^^^^^^^^^^^^^^^^^^^^^^^^^^^^^^^^^^
File "/usr/local/lib/python3.12/site-packages/hotness/builders/koji.py", line 205, in build
raise BuilderException(str(exc), value=output)
If you think this issue is caused by some bug in the-new-hotness, please report it on the-new-hotness issue tracker: https://github.com/fedora-infra/the-new-hotness/issues
Created attachment 2091064 [details]
Update to 1.16.0rc1 (#2332374)
Releases retrieved: 1.16.0rc2 Upstream release that is considered latest: 1.16.0rc2 Current version/release in rawhide: 1.14.1-3.fc42 URL: https://pypi.org/project/scipy Please consult the package updates policy before you issue an update to a stable branch: https://docs.fedoraproject.org/en-US/fesco/Updates_Policy/ More information about the service that created this bug can be found at: https://docs.fedoraproject.org/en-US/package-maintainers/Upstream_Release_Monitoring Please keep in mind that with any upstream change, there may also be packaging changes that need to be made. Specifically, please remember that it is your responsibility to review the new version to ensure that the licensing is still correct and that no non-free or legally problematic items have been added upstream. Based on the information from Anitya: https://release-monitoring.org/project/4768/ To change the monitoring settings for the project, please visit: https://src.fedoraproject.org/rpms/scipy Scratch build failed. Details below:
BuilderException: Build failed:
There is a syntax error in updated specfile. See attached diff for the changes.
Traceback:
File "/usr/local/lib/python3.12/site-packages/hotness/use_cases/package_scratch_build_use_case.py", line 56, in build
result = self.builder.build(request.package, request.opts)
^^^^^^^^^^^^^^^^^^^^^^^^^^^^^^^^^^^^^^^^^^^^^^^^^
File "/usr/local/lib/python3.12/site-packages/hotness/builders/koji.py", line 205, in build
raise BuilderException(str(exc), value=output)
If you think this issue is caused by some bug in the-new-hotness, please report it on the-new-hotness issue tracker: https://github.com/fedora-infra/the-new-hotness/issues
Created attachment 2093452 [details]
Update to 1.16.0rc2 (#2332374)
Releases retrieved: 1.16.1 Upstream release that is considered latest: 1.16.1 Current version/release in rawhide: 1.15.3-4.fc43 URL: https://pypi.org/project/scipy Please consult the package updates policy before you issue an update to a stable branch: https://docs.fedoraproject.org/en-US/fesco/Updates_Policy/ More information about the service that created this bug can be found at: https://docs.fedoraproject.org/en-US/package-maintainers/Upstream_Release_Monitoring Please keep in mind that with any upstream change, there may also be packaging changes that need to be made. Specifically, please remember that it is your responsibility to review the new version to ensure that the licensing is still correct and that no non-free or legally problematic items have been added upstream. Based on the information from Anitya: https://release-monitoring.org/project/4768/ To change the monitoring settings for the project, please visit: https://src.fedoraproject.org/rpms/scipy Created attachment 2098475 [details]
Update to 1.16.1 (#2332374)
the-new-hotness/release-monitoring.org's scratch build of scipy-1.16.1-1.fc40.src.rpm for rawhide failed http://koji.fedoraproject.org/koji/taskinfo?taskID=135364208 Releases retrieved: 1.16.2 Upstream release that is considered latest: 1.16.2 Current version/release in rawhide: 1.15.3-5.fc44 URL: https://pypi.org/project/scipy Please consult the package updates policy before you issue an update to a stable branch: https://docs.fedoraproject.org/en-US/fesco/Updates_Policy/ More information about the service that created this bug can be found at: https://docs.fedoraproject.org/en-US/package-maintainers/Upstream_Release_Monitoring Please keep in mind that with any upstream change, there may also be packaging changes that need to be made. Specifically, please remember that it is your responsibility to review the new version to ensure that the licensing is still correct and that no non-free or legally problematic items have been added upstream. Based on the information from Anitya: https://release-monitoring.org/project/4768/ To change the monitoring settings for the project, please visit: https://src.fedoraproject.org/rpms/scipy Created attachment 2106380 [details]
Update to 1.16.2 (#2332374)
the-new-hotness/release-monitoring.org's scratch build of scipy-1.16.2-1.fc40.src.rpm for rawhide failed http://koji.fedoraproject.org/koji/taskinfo?taskID=137025661 FEDORA-2025-55c4eda850 (scipy-1.16.2-1.fc43) has been submitted as an update to Fedora 43. https://bodhi.fedoraproject.org/updates/FEDORA-2025-55c4eda850 FEDORA-2025-55c4eda850 has been pushed to the Fedora 43 testing repository. Soon you'll be able to install the update with the following command: `sudo dnf upgrade --enablerepo=updates-testing --refresh --advisory=FEDORA-2025-55c4eda850` You can provide feedback for this update here: https://bodhi.fedoraproject.org/updates/FEDORA-2025-55c4eda850 See also https://fedoraproject.org/wiki/QA:Updates_Testing for more information on how to test updates. FEDORA-2025-55c4eda850 (scipy-1.16.2-1.fc43) has been pushed to the Fedora 43 stable repository. If problem still persists, please make note of it in this bug report. |