Bug 2333319
| Summary: | rear-2.8 is available | ||||||||||
|---|---|---|---|---|---|---|---|---|---|---|---|
| Product: | [Fedora] Fedora | Reporter: | Upstream Release Monitoring <upstream-release-monitoring> | ||||||||
| Component: | rear | Assignee: | Lukáš Zaoral <lzaoral> | ||||||||
| Status: | CLOSED DUPLICATE | QA Contact: | Fedora Extras Quality Assurance <extras-qa> | ||||||||
| Severity: | unspecified | Docs Contact: | |||||||||
| Priority: | unspecified | ||||||||||
| Version: | rawhide | CC: | lzaoral, pcahyna | ||||||||
| Target Milestone: | --- | Keywords: | FutureFeature, Triaged | ||||||||
| Target Release: | --- | ||||||||||
| Hardware: | Unspecified | ||||||||||
| OS: | Unspecified | ||||||||||
| Whiteboard: | |||||||||||
| Fixed In Version: | Doc Type: | If docs needed, set a value | |||||||||
| Doc Text: | Story Points: | --- | |||||||||
| Clone Of: | Environment: | ||||||||||
| Last Closed: | 2025-02-03 08:13:11 UTC | Type: | --- | ||||||||
| Regression: | --- | Mount Type: | --- | ||||||||
| Documentation: | --- | CRM: | |||||||||
| Verified Versions: | Category: | --- | |||||||||
| oVirt Team: | --- | RHEL 7.3 requirements from Atomic Host: | |||||||||
| Cloudforms Team: | --- | Target Upstream Version: | |||||||||
| Embargoed: | |||||||||||
| Attachments: |
|
||||||||||
|
Description
Upstream Release Monitoring
2024-12-19 13:21:58 UTC
Scratch build failed. Details below:
BuilderException: Build failed:
Command '['rpmbuild', '-D', '_sourcedir .', '-D', '_topdir .', '-bs', '/var/tmp/thn-mggd647l/rear.spec']' returned non-zero exit status 1.
StdOut:
setting SOURCE_DATE_EPOCH=1734566400
error: Bad file: ./rear-2.8-clean.tar.gz: No such file or directory
RPM build errors:
Bad file: ./rear-2.8-clean.tar.gz: No such file or directory
Traceback:
File "/usr/local/lib/python3.12/site-packages/hotness/use_cases/package_scratch_build_use_case.py", line 56, in build
result = self.builder.build(request.package, request.opts)
^^^^^^^^^^^^^^^^^^^^^^^^^^^^^^^^^^^^^^^^^^^^^^^^^
File "/usr/local/lib/python3.12/site-packages/hotness/builders/koji.py", line 229, in build
raise BuilderException(
If you think this issue is caused by some bug in the-new-hotness, please report it on the-new-hotness issue tracker: https://github.com/fedora-infra/the-new-hotness/issues
Created attachment 2063180 [details]
Update to 2.8 (#2333319)
This is currently blocked on the following upstream issue: https://github.com/rear/rear/issues/3375 Scratch build failed. Details below:
BuilderException: Build failed:
Command '['rpmbuild', '-D', '_sourcedir .', '-D', '_topdir .', '-bs', '/var/tmp/thn-t6mbt0ow/rear.spec']' returned non-zero exit status 1.
StdOut:
setting SOURCE_DATE_EPOCH=1738108800
error: Bad file: ./rear-2.8-clean.tar.gz: No such file or directory
RPM build errors:
Bad file: ./rear-2.8-clean.tar.gz: No such file or directory
Traceback:
File "/usr/local/lib/python3.12/site-packages/hotness/use_cases/package_scratch_build_use_case.py", line 56, in build
result = self.builder.build(request.package, request.opts)
^^^^^^^^^^^^^^^^^^^^^^^^^^^^^^^^^^^^^^^^^^^^^^^^^
File "/usr/local/lib/python3.12/site-packages/hotness/builders/koji.py", line 229, in build
raise BuilderException(
If you think this issue is caused by some bug in the-new-hotness, please report it on the-new-hotness issue tracker: https://github.com/fedora-infra/the-new-hotness/issues
Created attachment 2074282 [details]
Update to 2.8 (#2333319)
Scratch build failed. Details below:
BuilderException: Build failed:
Command '['rpmbuild', '-D', '_sourcedir .', '-D', '_topdir .', '-bs', '/var/tmp/thn-3v7qrnjo/rear.spec']' returned non-zero exit status 1.
StdOut:
setting SOURCE_DATE_EPOCH=1738108800
error: Bad file: ./rear-2.8-clean.tar.gz: No such file or directory
RPM build errors:
Bad file: ./rear-2.8-clean.tar.gz: No such file or directory
Traceback:
File "/usr/local/lib/python3.12/site-packages/hotness/use_cases/package_scratch_build_use_case.py", line 56, in build
result = self.builder.build(request.package, request.opts)
^^^^^^^^^^^^^^^^^^^^^^^^^^^^^^^^^^^^^^^^^^^^^^^^^
File "/usr/local/lib/python3.12/site-packages/hotness/builders/koji.py", line 229, in build
raise BuilderException(
If you think this issue is caused by some bug in the-new-hotness, please report it on the-new-hotness issue tracker: https://github.com/fedora-infra/the-new-hotness/issues
Created attachment 2074310 [details]
Update to 2.8 (#2333319)
*** This bug has been marked as a duplicate of bug 2343296 *** |