Bug 2382124
|
Description
Upstream Release Monitoring
2025-07-20 09:06:01 UTC
Scratch build failed. Details below:
BuilderException: Build failed:
Command '['rpmbuild', '-D', '_sourcedir .', '-D', '_topdir .', '-bs', '/var/tmp/thn-d6zkjz_5/ucx.spec']' returned non-zero exit status 1.
StdOut:
setting SOURCE_DATE_EPOCH=1752969600
error: Bad file: ./ucx-1.19.0.tar.gz: No such file or directory
RPM build errors:
Bad file: ./ucx-1.19.0.tar.gz: No such file or directory
Traceback:
File "/usr/local/lib/python3.12/site-packages/hotness/use_cases/package_scratch_build_use_case.py", line 56, in build
result = self.builder.build(request.package, request.opts)
^^^^^^^^^^^^^^^^^^^^^^^^^^^^^^^^^^^^^^^^^^^^^^^^^
File "/usr/local/lib/python3.12/site-packages/hotness/builders/koji.py", line 229, in build
raise BuilderException(
If you think this issue is caused by some bug in the-new-hotness, please report it on the-new-hotness issue tracker: https://github.com/fedora-infra/the-new-hotness/issues
Created attachment 2097758 [details]
Update to 1.19.0-rc2 (#2382124)
Releases retrieved: 1.19.0 Upstream release that is considered latest: 1.19.0 Current version/release in rawhide: 1.18.1-2.fc43 URL: http://www.openucx.org/ Please consult the package updates policy before you issue an update to a stable branch: https://docs.fedoraproject.org/en-US/fesco/Updates_Policy/ More information about the service that created this bug can be found at: https://docs.fedoraproject.org/en-US/package-maintainers/Upstream_Release_Monitoring Please keep in mind that with any upstream change, there may also be packaging changes that need to be made. Specifically, please remember that it is your responsibility to review the new version to ensure that the licensing is still correct and that no non-free or legally problematic items have been added upstream. Based on the information from Anitya: https://release-monitoring.org/project/16895/ To change the monitoring settings for the project, please visit: https://src.fedoraproject.org/rpms/ucx Created attachment 2102804 [details]
Update to 1.19.0 (#2382124)
the-new-hotness/release-monitoring.org's scratch build of ucx-1.19.0-1.fc40.src.rpm for rawhide failed http://koji.fedoraproject.org/koji/taskinfo?taskID=135761546 Releases retrieved: 1.19.1-rc1 Upstream release that is considered latest: 1.19.1-rc1 Current version/release in rawhide: 1.18.1-2.fc43 URL: http://www.openucx.org/ Please consult the package updates policy before you issue an update to a stable branch: https://docs.fedoraproject.org/en-US/fesco/Updates_Policy/ More information about the service that created this bug can be found at: https://docs.fedoraproject.org/en-US/package-maintainers/Upstream_Release_Monitoring Please keep in mind that with any upstream change, there may also be packaging changes that need to be made. Specifically, please remember that it is your responsibility to review the new version to ensure that the licensing is still correct and that no non-free or legally problematic items have been added upstream. Based on the information from Anitya: https://release-monitoring.org/project/16895/ To change the monitoring settings for the project, please visit: https://src.fedoraproject.org/rpms/ucx Scratch build failed. Details below:
BuilderException: Build failed:
Command '['rpmbuild', '-D', '_sourcedir .', '-D', '_topdir .', '-bs', '/var/tmp/thn-_6fa7yhn/ucx.spec']' returned non-zero exit status 1.
StdOut:
setting SOURCE_DATE_EPOCH=1758412800
error: Bad file: ./ucx-1.19.1.tar.gz: No such file or directory
RPM build errors:
Bad file: ./ucx-1.19.1.tar.gz: No such file or directory
Traceback:
File "/usr/local/lib/python3.12/site-packages/hotness/use_cases/package_scratch_build_use_case.py", line 56, in build
result = self.builder.build(request.package, request.opts)
^^^^^^^^^^^^^^^^^^^^^^^^^^^^^^^^^^^^^^^^^^^^^^^^^
File "/usr/local/lib/python3.12/site-packages/hotness/builders/koji.py", line 229, in build
raise BuilderException(
If you think this issue is caused by some bug in the-new-hotness, please report it on the-new-hotness issue tracker: https://github.com/fedora-infra/the-new-hotness/issues
Created attachment 2107206 [details]
Update to 1.19.1-rc1 (#2382124)
Releases retrieved: 1.19.1-rc2 Upstream release that is considered latest: 1.19.1-rc2 Current version/release in rawhide: 1.18.1-2.fc43 URL: http://www.openucx.org/ Please consult the package updates policy before you issue an update to a stable branch: https://docs.fedoraproject.org/en-US/fesco/Updates_Policy/ More information about the service that created this bug can be found at: https://docs.fedoraproject.org/en-US/package-maintainers/Upstream_Release_Monitoring Please keep in mind that with any upstream change, there may also be packaging changes that need to be made. Specifically, please remember that it is your responsibility to review the new version to ensure that the licensing is still correct and that no non-free or legally problematic items have been added upstream. Based on the information from Anitya: https://release-monitoring.org/project/16895/ To change the monitoring settings for the project, please visit: https://src.fedoraproject.org/rpms/ucx Scratch build failed. Details below:
BuilderException: Build failed:
Command '['rpmbuild', '-D', '_sourcedir .', '-D', '_topdir .', '-bs', '/var/tmp/thn-f2eig2eb/ucx.spec']' returned non-zero exit status 1.
StdOut:
setting SOURCE_DATE_EPOCH=1761004800
error: Bad file: ./ucx-1.19.1.tar.gz: No such file or directory
RPM build errors:
Bad file: ./ucx-1.19.1.tar.gz: No such file or directory
Traceback:
File "/usr/local/lib/python3.12/site-packages/hotness/use_cases/package_scratch_build_use_case.py", line 56, in build
result = self.builder.build(request.package, request.opts)
^^^^^^^^^^^^^^^^^^^^^^^^^^^^^^^^^^^^^^^^^^^^^^^^^
File "/usr/local/lib/python3.12/site-packages/hotness/builders/koji.py", line 229, in build
raise BuilderException(
If you think this issue is caused by some bug in the-new-hotness, please report it on the-new-hotness issue tracker: https://github.com/fedora-infra/the-new-hotness/issues
Created attachment 2110363 [details]
Update to 1.19.1-rc2 (#2382124)
This package has changed maintainer in Fedora. Reassigning to the new maintainer of this component. This package has changed maintainer in Fedora. Reassigning to the new maintainer of this component. Releases retrieved: 1.20.0-rc1 Upstream release that is considered latest: 1.20.0-rc1 Current version/release in rawhide: 1.18.1-3.fc44 URL: http://www.openucx.org/ Please consult the package updates policy before you issue an update to a stable branch: https://docs.fedoraproject.org/en-US/fesco/Updates_Policy/ More information about the service that created this bug can be found at: https://docs.fedoraproject.org/en-US/package-maintainers/Upstream_Release_Monitoring Please keep in mind that with any upstream change, there may also be packaging changes that need to be made. Specifically, please remember that it is your responsibility to review the new version to ensure that the licensing is still correct and that no non-free or legally problematic items have been added upstream. Based on the information from Anitya: https://release-monitoring.org/project/16895/ To change the monitoring settings for the project, please visit: https://src.fedoraproject.org/rpms/ucx Scratch build failed. Details below:
BuilderException: Build failed:
Command '['rpmbuild', '-D', '_sourcedir .', '-D', '_topdir .', '-bs', '/var/tmp/thn-0q40d2tv/ucx.spec']' returned non-zero exit status 1.
StdOut:
setting SOURCE_DATE_EPOCH=1764201600
error: Bad file: ./ucx-1.20.0.tar.gz: No such file or directory
RPM build errors:
Bad file: ./ucx-1.20.0.tar.gz: No such file or directory
Traceback:
File "/usr/local/lib/python3.12/site-packages/hotness/use_cases/package_scratch_build_use_case.py", line 56, in build
result = self.builder.build(request.package, request.opts)
^^^^^^^^^^^^^^^^^^^^^^^^^^^^^^^^^^^^^^^^^^^^^^^^^
File "/usr/local/lib/python3.12/site-packages/hotness/builders/koji.py", line 229, in build
raise BuilderException(
If you think this issue is caused by some bug in the-new-hotness, please report it on the-new-hotness issue tracker: https://github.com/fedora-infra/the-new-hotness/issues
Created attachment 2116374 [details]
Update to 1.20.0-rc1 (#2382124)
Scratch build failed. Details below:
BuilderException: Build failed:
Command '['rpmbuild', '-D', '_sourcedir .', '-D', '_topdir .', '-bs', '/var/tmp/thn-rcnpknp_/ucx.spec']' returned non-zero exit status 1.
StdOut:
setting SOURCE_DATE_EPOCH=1765065600
error: Bad file: ./ucx-1.20.0.tar.gz: No such file or directory
RPM build errors:
Bad file: ./ucx-1.20.0.tar.gz: No such file or directory
Traceback:
File "/usr/local/lib/python3.12/site-packages/hotness/use_cases/package_scratch_build_use_case.py", line 56, in build
result = self.builder.build(request.package, request.opts)
^^^^^^^^^^^^^^^^^^^^^^^^^^^^^^^^^^^^^^^^^^^^^^^^^
File "/usr/local/lib/python3.12/site-packages/hotness/builders/koji.py", line 229, in build
raise BuilderException(
If you think this issue is caused by some bug in the-new-hotness, please report it on the-new-hotness issue tracker: https://github.com/fedora-infra/the-new-hotness/issues
Created attachment 2117816 [details]
Update to 1.20.0-rc1 (#2382124)
Releases retrieved: 1.20.0 Upstream release that is considered latest: 1.20.0 Current version/release in rawhide: 1.19.0-2.fc44 URL: http://www.openucx.org/ Please consult the package updates policy before you issue an update to a stable branch: https://docs.fedoraproject.org/en-US/fesco/Updates_Policy/ More information about the service that created this bug can be found at: https://docs.fedoraproject.org/en-US/package-maintainers/Upstream_Release_Monitoring Please keep in mind that with any upstream change, there may also be packaging changes that need to be made. Specifically, please remember that it is your responsibility to review the new version to ensure that the licensing is still correct and that no non-free or legally problematic items have been added upstream. Based on the information from Anitya: https://release-monitoring.org/project/16895/ To change the monitoring settings for the project, please visit: https://src.fedoraproject.org/rpms/ucx Created attachment 2128301 [details]
Update to 1.20.0 (#2382124)
the-new-hotness/release-monitoring.org's scratch build of ucx-1.20.0-1.fc40.src.rpm for rawhide completed http://koji.fedoraproject.org/koji/taskinfo?taskID=141945935 Releases retrieved: 1.20.1-rc1 Upstream release that is considered latest: 1.20.1-rc1 Current version/release in rawhide: 1.19.0-2.fc44 URL: http://www.openucx.org/ Please consult the package updates policy before you issue an update to a stable branch: https://docs.fedoraproject.org/en-US/fesco/Updates_Policy/ More information about the service that created this bug can be found at: https://docs.fedoraproject.org/en-US/package-maintainers/Upstream_Release_Monitoring Please keep in mind that with any upstream change, there may also be packaging changes that need to be made. Specifically, please remember that it is your responsibility to review the new version to ensure that the licensing is still correct and that no non-free or legally problematic items have been added upstream. Based on the information from Anitya: https://release-monitoring.org/project/16895/ To change the monitoring settings for the project, please visit: https://src.fedoraproject.org/rpms/ucx Scratch build failed. Details below:
BuilderException: Build failed:
Command '['rpmbuild', '-D', '_sourcedir .', '-D', '_topdir .', '-bs', '/var/tmp/thn-qaaetmhb/ucx.spec']' returned non-zero exit status 1.
StdOut:
setting SOURCE_DATE_EPOCH=1774137600
error: Bad file: ./ucx-1.20.1.tar.gz: No such file or directory
RPM build errors:
Bad file: ./ucx-1.20.1.tar.gz: No such file or directory
Traceback:
File "/usr/local/lib/python3.12/site-packages/hotness/use_cases/package_scratch_build_use_case.py", line 56, in build
result = self.builder.build(request.package, request.opts)
^^^^^^^^^^^^^^^^^^^^^^^^^^^^^^^^^^^^^^^^^^^^^^^^^
File "/usr/local/lib/python3.12/site-packages/hotness/builders/koji.py", line 229, in build
raise BuilderException(
If you think this issue is caused by some bug in the-new-hotness, please report it on the-new-hotness issue tracker: https://github.com/fedora-infra/the-new-hotness/issues
Created attachment 2134480 [details]
Update to 1.20.1-rc1 (#2382124)
Releases retrieved: 1.20.1-rc2 Upstream release that is considered latest: 1.20.1-rc2 Current version/release in rawhide: 1.19.0-2.fc44 URL: http://www.openucx.org/ Please consult the package updates policy before you issue an update to a stable branch: https://docs.fedoraproject.org/en-US/fesco/Updates_Policy/ More information about the service that created this bug can be found at: https://docs.fedoraproject.org/en-US/package-maintainers/Upstream_Release_Monitoring Please keep in mind that with any upstream change, there may also be packaging changes that need to be made. Specifically, please remember that it is your responsibility to review the new version to ensure that the licensing is still correct and that no non-free or legally problematic items have been added upstream. Based on the information from Anitya: https://release-monitoring.org/project/16895/ To change the monitoring settings for the project, please visit: https://src.fedoraproject.org/rpms/ucx Scratch build failed. Details below:
BuilderException: Build failed:
Command '['rpmbuild', '-D', '_sourcedir .', '-D', '_topdir .', '-bs', '/var/tmp/thn-kwtxurbe/ucx.spec']' returned non-zero exit status 1.
StdOut:
setting SOURCE_DATE_EPOCH=1775433600
error: Bad file: ucx-1.20.1.tar.gz: No such file or directory
RPM build errors:
Bad file: ucx-1.20.1.tar.gz: No such file or directory
Traceback:
File "/usr/local/lib/python3.14/site-packages/hotness/use_cases/package_scratch_build_use_case.py", line 55, in build
result = self.builder.build(request.package, request.opts)
File "/usr/local/lib/python3.14/site-packages/hotness/builders/koji.py", line 251, in build
raise BuilderException(
str(exc), value=output, std_out=std_out, std_err=std_err
)
If you think this issue is caused by some bug in the-new-hotness, please report it on the-new-hotness issue tracker: https://github.com/fedora-infra/the-new-hotness/issues
Created attachment 2136048 [details]
Update to 1.20.1-rc2 (#2382124)
Releases retrieved: 1.20.1 Upstream release that is considered latest: 1.20.1 Current version/release in rawhide: 1.19.0-2.fc44 URL: http://www.openucx.org/ Please consult the package updates policy before you issue an update to a stable branch: https://docs.fedoraproject.org/en-US/fesco/Updates_Policy/ More information about the service that created this bug can be found at: https://docs.fedoraproject.org/en-US/package-maintainers/Upstream_Release_Monitoring Please keep in mind that with any upstream change, there may also be packaging changes that need to be made. Specifically, please remember that it is your responsibility to review the new version to ensure that the licensing is still correct and that no non-free or legally problematic items have been added upstream. Based on the information from Anitya: https://release-monitoring.org/project/16895/ To change the monitoring settings for the project, please visit: https://src.fedoraproject.org/rpms/ucx Scratch build failed. Details below:
BuilderException: Build failed:
Command '['rpmbuild', '-D', '_sourcedir .', '-D', '_topdir .', '-bs', '/var/tmp/thn-s6je8anl/ucx.spec']' returned non-zero exit status 1.
StdOut:
setting SOURCE_DATE_EPOCH=1778025600
error: Bad file: ucx-1.20.1.tar.gz: No such file or directory
RPM build errors:
Bad file: ucx-1.20.1.tar.gz: No such file or directory
Traceback:
File "/usr/local/lib/python3.14/site-packages/hotness/use_cases/package_scratch_build_use_case.py", line 55, in build
result = self.builder.build(request.package, request.opts)
File "/usr/local/lib/python3.14/site-packages/hotness/builders/koji.py", line 251, in build
raise BuilderException(
str(exc), value=output, std_out=std_out, std_err=std_err
)
If you think this issue is caused by some bug in the-new-hotness, please report it on the-new-hotness issue tracker: https://github.com/fedora-infra/the-new-hotness/issues
Created attachment 2139755 [details]
Update to 1.20.1 (#2382124)
Releases retrieved: 1.21.0-rc1 Upstream release that is considered latest: 1.21.0-rc1 Current version/release in rawhide: 1.19.0-2.fc44 URL: http://www.openucx.org/ Please consult the package updates policy before you issue an update to a stable branch: https://docs.fedoraproject.org/en-US/fesco/Updates_Policy/ More information about the service that created this bug can be found at: https://docs.fedoraproject.org/en-US/package-maintainers/Upstream_Release_Monitoring Please keep in mind that with any upstream change, there may also be packaging changes that need to be made. Specifically, please remember that it is your responsibility to review the new version to ensure that the licensing is still correct and that no non-free or legally problematic items have been added upstream. Based on the information from Anitya: https://release-monitoring.org/project/16895/ To change the monitoring settings for the project, please visit: https://src.fedoraproject.org/rpms/ucx Scratch build failed. Details below:
BuilderException: Build failed:
Command '['rpmbuild', '-D', '_sourcedir .', '-D', '_topdir .', '-bs', '/var/tmp/thn-lqkpiy59/ucx.spec']' returned non-zero exit status 1.
StdOut:
setting SOURCE_DATE_EPOCH=1779580800
error: Bad file: ucx-1.21.0.tar.gz: No such file or directory
RPM build errors:
Bad file: ucx-1.21.0.tar.gz: No such file or directory
Traceback:
File "/usr/local/lib/python3.14/site-packages/hotness/use_cases/package_scratch_build_use_case.py", line 55, in build
result = self.builder.build(request.package, request.opts)
File "/usr/local/lib/python3.14/site-packages/hotness/builders/koji.py", line 251, in build
raise BuilderException(
str(exc), value=output, std_out=std_out, std_err=std_err
)
If you think this issue is caused by some bug in the-new-hotness, please report it on the-new-hotness issue tracker: https://github.com/fedora-infra/the-new-hotness/issues
Created attachment 2142678 [details]
Update to 1.21.0-rc1 (#2382124)
Releases retrieved: 1.21.0-rc2 Upstream release that is considered latest: 1.21.0-rc2 Current version/release in rawhide: 1.19.0-2.fc44 URL: http://www.openucx.org/ Please consult the package updates policy before you issue an update to a stable branch: https://docs.fedoraproject.org/en-US/fesco/Updates_Policy/ More information about the service that created this bug can be found at: https://docs.fedoraproject.org/en-US/package-maintainers/Upstream_Release_Monitoring Please keep in mind that with any upstream change, there may also be packaging changes that need to be made. Specifically, please remember that it is your responsibility to review the new version to ensure that the licensing is still correct and that no non-free or legally problematic items have been added upstream. Based on the information from Anitya: https://release-monitoring.org/project/16895/ To change the monitoring settings for the project, please visit: https://src.fedoraproject.org/rpms/ucx Scratch build failed. Details below:
BuilderException: Build failed:
Command '['rpmbuild', '-D', '_sourcedir .', '-D', '_topdir .', '-bs', '/var/tmp/thn-56oxusy8/ucx.spec']' returned non-zero exit status 1.
StdOut:
setting SOURCE_DATE_EPOCH=1780876800
error: Bad file: ucx-1.21.0.tar.gz: No such file or directory
RPM build errors:
Bad file: ucx-1.21.0.tar.gz: No such file or directory
Traceback:
File "/usr/local/lib/python3.14/site-packages/hotness/use_cases/package_scratch_build_use_case.py", line 55, in build
result = self.builder.build(request.package, request.opts)
File "/usr/local/lib/python3.14/site-packages/hotness/builders/koji.py", line 251, in build
raise BuilderException(
str(exc), value=output, std_out=std_out, std_err=std_err
)
If you think this issue is caused by some bug in the-new-hotness, please report it on the-new-hotness issue tracker: https://github.com/fedora-infra/the-new-hotness/issues
Created attachment 2144686 [details]
Update to 1.21.0-rc2 (#2382124)
Releases retrieved: 1.21.0 Upstream release that is considered latest: 1.21.0 Current version/release in rawhide: 1.19.0-2.fc44 URL: http://www.openucx.org/ Please consult the package updates policy before you issue an update to a stable branch: https://docs.fedoraproject.org/en-US/fesco/Updates_Policy/ More information about the service that created this bug can be found at: https://docs.fedoraproject.org/en-US/package-maintainers/Upstream_Release_Monitoring Please keep in mind that with any upstream change, there may also be packaging changes that need to be made. Specifically, please remember that it is your responsibility to review the new version to ensure that the licensing is still correct and that no non-free or legally problematic items have been added upstream. Based on the information from Anitya: https://release-monitoring.org/project/16895/ To change the monitoring settings for the project, please visit: https://src.fedoraproject.org/rpms/ucx Scratch build failed. Details below:
BuilderException: Build failed:
Command '['rpmbuild', '-D', '_sourcedir .', '-D', '_topdir .', '-bs', '/var/tmp/thn-hhswvdu1/ucx.spec']' returned non-zero exit status 1.
StdOut:
setting SOURCE_DATE_EPOCH=1782259200
error: Bad file: ucx-1.21.0.tar.gz: No such file or directory
RPM build errors:
Bad file: ucx-1.21.0.tar.gz: No such file or directory
Traceback:
File "/usr/local/lib/python3.14/site-packages/hotness/use_cases/package_scratch_build_use_case.py", line 55, in build
result = self.builder.build(request.package, request.opts)
File "/usr/local/lib/python3.14/site-packages/hotness/builders/koji.py", line 251, in build
raise BuilderException(
str(exc), value=output, std_out=std_out, std_err=std_err
)
If you think this issue is caused by some bug in the-new-hotness, please report it on the-new-hotness issue tracker: https://github.com/fedora-infra/the-new-hotness/issues
Created attachment 2146517 [details]
Update to 1.21.0 (#2382124)
Releases retrieved: 1.22.0-rc1 Upstream release that is considered latest: 1.22.0-rc1 Current version/release in rawhide: 1.19.0-2.fc44 URL: http://www.openucx.org/ Please consult the package updates policy before you issue an update to a stable branch: https://docs.fedoraproject.org/en-US/fesco/Updates_Policy/ More information about the service that created this bug can be found at: https://docs.fedoraproject.org/en-US/package-maintainers/Upstream_Release_Monitoring Please keep in mind that with any upstream change, there may also be packaging changes that need to be made. Specifically, please remember that it is your responsibility to review the new version to ensure that the licensing is still correct and that no non-free or legally problematic items have been added upstream. Based on the information from Anitya: https://release-monitoring.org/project/16895/ To change the monitoring settings for the project, please visit: https://src.fedoraproject.org/rpms/ucx Scratch build failed. Details below:
BuilderException: Build failed:
Command '['rpmbuild', '-D', '_sourcedir .', '-D', '_topdir .', '-bs', '/var/tmp/thn-64e0cp0e/ucx.spec']' returned non-zero exit status 1.
StdOut:
setting SOURCE_DATE_EPOCH=1782864000
error: Bad file: ucx-1.22.0.tar.gz: No such file or directory
RPM build errors:
Bad file: ucx-1.22.0.tar.gz: No such file or directory
Traceback:
File "/usr/local/lib/python3.14/site-packages/hotness/use_cases/package_scratch_build_use_case.py", line 55, in build
result = self.builder.build(request.package, request.opts)
File "/usr/local/lib/python3.14/site-packages/hotness/builders/koji.py", line 251, in build
raise BuilderException(
str(exc), value=output, std_out=std_out, std_err=std_err
)
If you think this issue is caused by some bug in the-new-hotness, please report it on the-new-hotness issue tracker: https://github.com/fedora-infra/the-new-hotness/issues
Created attachment 2147275 [details]
Update to 1.22.0-rc1 (#2382124)
Releases retrieved: 1.22.0-rc2 Upstream release that is considered latest: 1.22.0-rc2 Current version/release in rawhide: 1.19.0-2.fc44 URL: http://www.openucx.org/ Please consult the package updates policy before you issue an update to a stable branch: https://docs.fedoraproject.org/en-US/fesco/Updates_Policy/ More information about the service that created this bug can be found at: https://docs.fedoraproject.org/en-US/package-maintainers/Upstream_Release_Monitoring Please keep in mind that with any upstream change, there may also be packaging changes that need to be made. Specifically, please remember that it is your responsibility to review the new version to ensure that the licensing is still correct and that no non-free or legally problematic items have been added upstream. Based on the information from Anitya: https://release-monitoring.org/project/16895/ To change the monitoring settings for the project, please visit: https://src.fedoraproject.org/rpms/ucx Scratch build failed. Details below:
BuilderException: Build failed:
Command '['rpmbuild', '-D', '_sourcedir .', '-D', '_topdir .', '-bs', '/var/tmp/thn-5vcm7im5/ucx.spec']' returned non-zero exit status 1.
StdOut:
setting SOURCE_DATE_EPOCH=1784160000
error: Bad file: ucx-1.22.0.tar.gz: No such file or directory
RPM build errors:
Bad file: ucx-1.22.0.tar.gz: No such file or directory
Traceback:
File "/usr/local/lib/python3.14/site-packages/hotness/use_cases/package_scratch_build_use_case.py", line 55, in build
result = self.builder.build(request.package, request.opts)
File "/usr/local/lib/python3.14/site-packages/hotness/builders/koji.py", line 251, in build
raise BuilderException(
str(exc), value=output, std_out=std_out, std_err=std_err
)
If you think this issue is caused by some bug in the-new-hotness, please report it on the-new-hotness issue tracker: https://github.com/fedora-infra/the-new-hotness/issues
Created attachment 2148899 [details]
Update to 1.22.0-rc2 (#2382124)
Releases retrieved: 1.22.0 Upstream release that is considered latest: 1.22.0 Current version/release in rawhide: 1.19.0-3.fc45 URL: http://www.openucx.org/ Please consult the package updates policy before you issue an update to a stable branch: https://docs.fedoraproject.org/en-US/fesco/Updates_Policy/ More information about the service that created this bug can be found at: https://docs.fedoraproject.org/en-US/package-maintainers/Upstream_Release_Monitoring Please keep in mind that with any upstream change, there may also be packaging changes that need to be made. Specifically, please remember that it is your responsibility to review the new version to ensure that the licensing is still correct and that no non-free or legally problematic items have been added upstream. Based on the information from Anitya: https://release-monitoring.org/project/16895/ To change the monitoring settings for the project, please visit: https://src.fedoraproject.org/rpms/ucx Scratch build failed. Details below:
BuilderException: Build failed:
Command '['rpmbuild', '-D', '_sourcedir .', '-D', '_topdir .', '-bs', '/var/tmp/thn-f8hfwu8x/ucx.spec']' returned non-zero exit status 1.
StdOut:
setting SOURCE_DATE_EPOCH=1785628800
error: Bad file: ucx-1.22.0.tar.gz: No such file or directory
RPM build errors:
Bad file: ucx-1.22.0.tar.gz: No such file or directory
Traceback:
File "/usr/local/lib/python3.14/site-packages/hotness/use_cases/package_scratch_build_use_case.py", line 55, in build
result = self.builder.build(request.package, request.opts)
File "/usr/local/lib/python3.14/site-packages/hotness/builders/koji.py", line 251, in build
raise BuilderException(
str(exc), value=output, std_out=std_out, std_err=std_err
)
If you think this issue is caused by some bug in the-new-hotness, please report it on the-new-hotness issue tracker: https://github.com/fedora-infra/the-new-hotness/issues
Created attachment 2153316 [details]
Update to 1.22.0 (#2382124)
Created attachment 2155030 [details]
Update to 1.22.0 (#2382124)
the-new-hotness/release-monitoring.org's scratch build of ucx-1.22.0-1.fc44.src.rpm for rawhide failed http://koji.fedoraproject.org/koji/taskinfo?taskID=149315695 |