Bug 2433484
| Summary: | avahi-0.9-rc5 is available | ||||||||||
|---|---|---|---|---|---|---|---|---|---|---|---|
| Product: | [Fedora] Fedora | Reporter: | Upstream Release Monitoring <upstream-release-monitoring> | ||||||||
| Component: | avahi | Assignee: | Michal Sekletar <msekleta> | ||||||||
| Status: | NEW --- | QA Contact: | Fedora Extras Quality Assurance <extras-qa> | ||||||||
| Severity: | unspecified | Docs Contact: | |||||||||
| Priority: | unspecified | ||||||||||
| Version: | rawhide | CC: | mpitt, msekleta, mzeuom, pemensik | ||||||||
| Target Milestone: | --- | Keywords: | FutureFeature, Triaged | ||||||||
| Target Release: | --- | ||||||||||
| Hardware: | Unspecified | ||||||||||
| OS: | Unspecified | ||||||||||
| Whiteboard: | |||||||||||
| Fixed In Version: | Doc Type: | --- | |||||||||
| Doc Text: | Story Points: | --- | |||||||||
| Clone Of: | Environment: | ||||||||||
| Last Closed: | Type: | --- | |||||||||
| Regression: | --- | Mount Type: | --- | ||||||||
| Documentation: | --- | CRM: | |||||||||
| Verified Versions: | Category: | --- | |||||||||
| oVirt Team: | --- | RHEL 7.3 requirements from Atomic Host: | |||||||||
| Cloudforms Team: | --- | Target Upstream Version: | |||||||||
| Embargoed: | |||||||||||
| Attachments: |
|
||||||||||
|
Description
Upstream Release Monitoring
2026-01-27 19:52:59 UTC
Scratch build failed. Details below:
BuilderException: Build failed:
There is a syntax error in updated specfile. See attached diff for the changes.
Traceback:
File "/usr/local/lib/python3.12/site-packages/hotness/use_cases/package_scratch_build_use_case.py", line 56, in build
result = self.builder.build(request.package, request.opts)
^^^^^^^^^^^^^^^^^^^^^^^^^^^^^^^^^^^^^^^^^^^^^^^^^
File "/usr/local/lib/python3.12/site-packages/hotness/builders/koji.py", line 205, in build
raise BuilderException(str(exc), value=output)
If you think this issue is caused by some bug in the-new-hotness, please report it on the-new-hotness issue tracker: https://github.com/fedora-infra/the-new-hotness/issues
Created attachment 2123971 [details]
Update to 0.9-rc3 (#2433484)
Releases retrieved: 0.9-rc4 Upstream release that is considered latest: 0.9-rc4 Current version/release in rawhide: 0.9~rc2-8.fc44 URL: http://avahi.org/ Please consult the package updates policy before you issue an update to a stable branch: https://docs.fedoraproject.org/en-US/fesco/Updates_Policy/ More information about the service that created this bug can be found at: https://docs.fedoraproject.org/en-US/package-maintainers/Upstream_Release_Monitoring Please keep in mind that with any upstream change, there may also be packaging changes that need to be made. Specifically, please remember that it is your responsibility to review the new version to ensure that the licensing is still correct and that no non-free or legally problematic items have been added upstream. Based on the information from Anitya: https://release-monitoring.org/project/147/ To change the monitoring settings for the project, please visit: https://src.fedoraproject.org/rpms/avahi Scratch build failed. Details below:
BuilderException: Build failed:
There is a syntax error in updated specfile. See attached diff for the changes.
Traceback:
File "/usr/local/lib/python3.14/site-packages/hotness/use_cases/package_scratch_build_use_case.py", line 55, in build
result = self.builder.build(request.package, request.opts)
File "/usr/local/lib/python3.14/site-packages/hotness/builders/koji.py", line 227, in build
raise BuilderException(str(exc), value=output)
If you think this issue is caused by some bug in the-new-hotness, please report it on the-new-hotness issue tracker: https://github.com/fedora-infra/the-new-hotness/issues
Created attachment 2135622 [details]
Update to 0.9-rc4 (#2433484)
I sent https://src.fedoraproject.org/rpms/avahi/pull-request/22 to update to rc4. Releases retrieved: 0.9-rc5 Upstream release that is considered latest: 0.9-rc5 Current version/release in rawhide: 0.9~rc2-8.fc44 URL: http://avahi.org/ Please consult the package updates policy before you issue an update to a stable branch: https://docs.fedoraproject.org/en-US/fesco/Updates_Policy/ More information about the service that created this bug can be found at: https://docs.fedoraproject.org/en-US/package-maintainers/Upstream_Release_Monitoring Please keep in mind that with any upstream change, there may also be packaging changes that need to be made. Specifically, please remember that it is your responsibility to review the new version to ensure that the licensing is still correct and that no non-free or legally problematic items have been added upstream. Based on the information from Anitya: https://release-monitoring.org/project/147/ To change the monitoring settings for the project, please visit: https://src.fedoraproject.org/rpms/avahi Scratch build failed. Details below:
BuilderException: Build failed:
There is a syntax error in updated specfile. See attached diff for the changes.
Traceback:
File "/usr/local/lib/python3.14/site-packages/hotness/use_cases/package_scratch_build_use_case.py", line 55, in build
result = self.builder.build(request.package, request.opts)
File "/usr/local/lib/python3.14/site-packages/hotness/builders/koji.py", line 227, in build
raise BuilderException(str(exc), value=output)
If you think this issue is caused by some bug in the-new-hotness, please report it on the-new-hotness issue tracker: https://github.com/fedora-infra/the-new-hotness/issues
Created attachment 2146617 [details]
Update to 0.9-rc5 (#2433484)
|