Bug 2485842
| Summary: | F45FailsToInstall: python3-dask+array, python3-dask+bag, python3-dask+dataframe, python3-dask+delayed, python3-dask+distributed, python3-dask | ||
|---|---|---|---|
| Product: | [Fedora] Fedora | Reporter: | Fedora Fails To Install <fti-bugs> |
| Component: | python-dask | Assignee: | Elliott Sales de Andrade <quantum.analyst> |
| Status: | CLOSED WORKSFORME | QA Contact: | Fedora Extras Quality Assurance <extras-qa> |
| Severity: | unspecified | Docs Contact: | |
| Priority: | unspecified | ||
| Version: | rawhide | CC: | code, epel-packagers-sig, jonathan, mhroncok, python-packagers-sig, quantum.analyst |
| Target Milestone: | --- | ||
| Target Release: | --- | ||
| Hardware: | Unspecified | ||
| OS: | Unspecified | ||
| Whiteboard: | |||
| Fixed In Version: | Doc Type: | --- | |
| Doc Text: | Story Points: | --- | |
| Clone Of: | Environment: | ||
| Last Closed: | 2026-06-18 10:26:44 UTC | Type: | --- |
| Regression: | --- | Mount Type: | --- |
| Documentation: | --- | CRM: | |
| Verified Versions: | Category: | --- | |
| oVirt Team: | --- | RHEL 7.3 requirements from Atomic Host: | |
| Cloudforms Team: | --- | Target Upstream Version: | |
| Embargoed: | |||
| Bug Depends On: | 2458729 | ||
| Bug Blocks: | 2412434, 2433833, 2433836, 2485681, 2485795, 2485844, 2485868, 2485925, 2485952, 2485982, 2485984, 2488375 | ||
|
Description
Fedora Fails To Install
2026-06-06 17:50:43 UTC
Even the bootstrap build is failing: FAILED dask/dataframe/io/tests/test_orc.py::test_orc_roundtrip[None-None] - worker 'gw13' crashed while running 'dask/dataframe/io/tests/test_orc.py::t... FAILED dask/dataframe/io/tests/test_orc.py::test_orc_roundtrip_aggregate_files[2] - worker 'gw24' crashed while running 'dask/dataframe/io/tests/test_orc.py::t... FAILED dask/dataframe/io/tests/test_orc.py::test_orc_roundtrip[columns1-None] - worker 'gw26' crashed while running 'dask/dataframe/io/tests/test_orc.py::t... FAILED dask/dataframe/io/tests/test_orc.py::test_orc_roundtrip_aggregate_files[True] - worker 'gw10' crashed while running 'dask/dataframe/io/tests/test_orc.py::t... FAILED dask/dataframe/io/tests/test_orc.py::test_orc_roundtrip[None-i32] - worker 'gw22' crashed while running 'dask/dataframe/io/tests/test_orc.py::t... FAILED dask/dataframe/io/tests/test_orc.py::test_orc_roundtrip[columns1-i32] - worker 'gw0' crashed while running 'dask/dataframe/io/tests/test_orc.py::te... FAILED dask/dataframe/io/tests/test_orc.py::test_orc_roundtrip_aggregate_files[False] - worker 'gw3' crashed while running 'dask/dataframe/io/tests/test_orc.py::te... FAILED dask/tests/test_multiprocessing.py::test_custom_context_used_python3_posix - DeprecationWarning: This process (pid=4346) is multi-threaded, use of fork(... FAILED dask/dataframe/io/tests/test_orc.py::test_orc_roundtrip_aggregate_files[4] - worker 'gw27' crashed while running 'dask/dataframe/io/tests/test_orc.py::t... FAILED dask/dataframe/io/tests/test_orc.py::test_to_orc_delayed - worker 'gw8' crashed while running 'dask/dataframe/io/tests/test_orc.py::te... This did not happen in copr :/ liborc2 was rebuilt for the Protobuf update since then. It's not used directly, but through pyarrow, so maybe that needs a rebuild (and/or libarrow as well.) I don't know why koji doesn't show the stack trace, but it's definitely protobuf+liborc: dask/dataframe/io/tests/test_orc.py::test_orc_roundtrip[columns1-i32] Fatal Python error: Segmentation fault Thread 0x00007f52a4f946c0 [ThreadPoolExecu] (most recent call first): <freed thread state> <freed thread state> Current thread's C stack trace (most recent call first): Binary file "/lib64/libpython3.15.so.1.0", at _Py_DumpStack+0x4c [0x7f530cb9556c] Binary file "/lib64/libpython3.15.so.1.0", at +0x39ea6d [0x7f530cb9ea6d] Binary file "/lib64/libc.so.6", at +0x93ff0 [0x7f530c698ff0] Binary file "/lib64/libprotobuf.so.33.5.0", at _ZN6google8protobuf8internal14WireFormatLite20InternalWriteMessageEiRKNS0_11MessageLiteEiPhPNS0_2io19EpsCopyOutputStreamE+0x12 [0x7f52dd41e4b2] Binary file "/lib64/liborc.so.2", at _ZNK3orc5proto8RowIndex18_InternalSerializeEPhPN6google8protobuf2io19EpsCopyOutputStreamE+0x66 [0x7f52ddb2d2f6] Binary file "/lib64/libprotobuf.so.30", at _ZNK6google8protobuf11MessageLite25SerializeToZeroCopyStreamEPNS0_2io20ZeroCopyOutputStreamE+0x30 [0x7f52dd7997b0] Binary file "/lib64/liborc.so.2", at _ZNK3orc12ColumnWriter10writeIndexERSt6vectorINS_5proto6StreamESaIS3_EE+0xe8 [0x7f52ddb61118] Binary file "/lib64/liborc.so.2", at _ZNK3orc18StructColumnWriter10writeIndexERSt6vectorINS_5proto6StreamESaIS3_EE+0x1f [0x7f52ddb6152f] Binary file "/lib64/liborc.so.2", at _ZN3orc10WriterImpl11writeStripeEv+0x9f [0x7f52ddbedbcf] Binary file "/lib64/liborc.so.2", at _ZN3orc10WriterImpl5closeEv+0x5d [0x7f52ddbee88d] Binary file "/lib64/libarrow.so.2300", at _ZN5arrow8adapters3orc13ORCFileWriter5CloseEv+0x24 [0x7f52df6587c4] Binary file "/usr/lib64/python3.15/site-packages/pyarrow/_orc.cpython-315-x86_64-linux-gnu.so", at +0x25521 [0x7f52d30d5521] Binary file "/lib64/libpython3.15.so.1.0", at +0x40a79f [0x7f530cc0a79f] Binary file "/lib64/libpython3.15.so.1.0", at +0x251567 [0x7f530ca51567] Binary file "/lib64/libpython3.15.so.1.0", at _PyFunction_Vectorcall+0x294 [0x7f530cc20664] Binary file "/lib64/libpython3.15.so.1.0", at +0x46c34a [0x7f530cc6c34a] Binary file "/lib64/libpython3.15.so.1.0", at +0x253204 [0x7f530ca53204] Binary file "/lib64/libpython3.15.so.1.0", at +0x4f31c1 [0x7f530ccf31c1] Binary file "/lib64/libpython3.15.so.1.0", at +0x560944 [0x7f530cd60944] Binary file "/lib64/libpython3.15.so.1.0", at _PyObject_MakeTpCall+0x43c [0x7f530cbe0e3c] Binary file "/lib64/libpython3.15.so.1.0", at +0x252911 [0x7f530ca52911] Binary file "/lib64/libpython3.15.so.1.0", at _PyFunction_Vectorcall+0x294 [0x7f530cc20664] Binary file "/lib64/libpython3.15.so.1.0", at +0x5725b4 I tried a local mock build (--with bootstrap) and was able to reproduce the failures in dask/dataframe/io/tests/test_orc.py with libarrow-23.0.1-3.fc45. Then I tried a scratch build (still --with bootstrap) in f45-build-side-140796, where libarrow was rebuilt for OpenSSL 4.0, https://koji.fedoraproject.org/koji/taskinfo?taskID=146570209. I still see similar tracebacks there, so it appears that rebuilding libarrow is not sufficient. FAILED dask/bytes/tests/test_http.py::test_loc - FileNotFoundError: http://localhost:8999/a FAILED dask/bytes/tests/test_http.py::test_fetch_range_with_headers - FileNotFoundError: http://localhost:8999/a FAILED dask/bytes/tests/test_http.py::test_ops[None] - FileNotFoundError: http://localhost:8999/a FAILED dask/bytes/tests/test_http.py::test_ops[99999] - FileNotFoundError: http://localhost:8999/a FAILED dask/dataframe/io/tests/test_orc.py::test_orc_roundtrip[None-None] - worker 'gw65' crashed while running 'dask/dataframe/io/tests/test_orc.py::t... FAILED dask/tests/test_multiprocessing.py::test_custom_context_used_python3_posix - DeprecationWarning: This process (pid=4542) is multi-threaded, use of fork(... FAILED dask/dataframe/io/tests/test_orc.py::test_orc_roundtrip_aggregate_files[4] - worker 'gw189' crashed while running 'dask/dataframe/io/tests/test_orc.py::... FAILED dask/dataframe/io/tests/test_orc.py::test_orc_roundtrip_aggregate_files[False] - worker 'gw30' crashed while running 'dask/dataframe/io/tests/test_orc.py::t... FAILED dask/dataframe/io/tests/test_orc.py::test_orc_roundtrip[columns1-None] - worker 'gw190' crashed while running 'dask/dataframe/io/tests/test_orc.py::... FAILED dask/dataframe/io/tests/test_orc.py::test_orc_roundtrip[None-i32] - worker 'gw118' crashed while running 'dask/dataframe/io/tests/test_orc.py::... FAILED dask/dataframe/io/tests/test_orc.py::test_to_orc_delayed - worker 'gw119' crashed while running 'dask/dataframe/io/tests/test_orc.py::... FAILED dask/dataframe/io/tests/test_orc.py::test_orc_roundtrip_aggregate_files[True] - worker 'gw167' crashed while running 'dask/dataframe/io/tests/test_orc.py::... FAILED dask/dataframe/io/tests/test_orc.py::test_orc_roundtrip[columns1-i32] - worker 'gw55' crashed while running 'dask/dataframe/io/tests/test_orc.py::t... FAILED dask/dataframe/io/tests/test_orc.py::test_orc_roundtrip_aggregate_files[2] - worker 'gw84' crashed while running 'dask/dataframe/io/tests/test_orc.py::t... = 14 failed, 15448 passed, 1292 skipped, 315 xfailed, 279 xpassed, 20 warnings in 109.01s (0:01:49) = Hello, Please note that this comment was generated automatically by https://forge.fedoraproject.org/releng/tooling/src/branch/main/release-process/bug-filing/follow-policy/follow_policy.py If you feel that this output has mistakes, please open an issue at https://forge.fedoraproject.org/releng/tickets/issues This package fails to install and maintainers are advised to take one of the following actions: - Fix this bug and close this bugzilla once the update makes it to the repository. (The same script that posted this comment will eventually close this bugzilla when the fixed package reaches the repository, so you don't have to worry about it.) or - Move this bug to ASSIGNED if you plan on fixing this, but simply haven't done so yet. or - Orphan the package if you no longer plan to maintain it. If you do not take one of these actions, the process at https://docs.fedoraproject.org/en-US/fesco/Fails_to_build_from_source_Fails_to_install/#_package_removal_for_long_standing_ftbfs_and_fti_bugs will continue. This package may be orphaned in 7+ weeks. This is the first reminder (step 3) from the policy. Don't hesitate to ask for help on https://lists.fedoraproject.org/archives/list/devel@lists.fedoraproject.org/ if you are unsure how to fix this bug. Hello, Please note that this comment was generated automatically by https://forge.fedoraproject.org/releng/tooling/src/branch/main/release-process/bug-filing/follow-policy/follow_policy.py If you feel that this output has mistakes, please open an issue at https://forge.fedoraproject.org/releng/tickets/issues All subpackages of a package against which this bug was filled are now installable or removed from Fedora 45. Thanks for taking care of it! |