Bug 1301196 - Not build kernel module wl.ko
Not build kernel module wl.ko
Status: CLOSED DUPLICATE of bug 1301145
Product: Fedora
Classification: Fedora
Component: kmod (Show other bugs)
23
x86_64 Linux
unspecified Severity unspecified
: ---
: ---
Assigned To: kmod development team
Fedora Extras Quality Assurance
:
Depends On:
Blocks:
  Show dependency treegraph
 
Reported: 2016-01-22 15:52 EST by Iskatel
Modified: 2016-01-22 16:26 EST (History)
2 users (show)

See Also:
Fixed In Version:
Doc Type: Bug Fix
Doc Text:
Story Points: ---
Clone Of:
Environment:
Last Closed: 2016-01-22 16:26:18 EST
Type: Bug
Regression: ---
Mount Type: ---
Documentation: ---
CRM:
Verified Versions:
Category: ---
oVirt Team: ---
RHEL 7.3 requirements from Atomic Host:
Cloudforms Team: ---


Attachments (Terms of Use)

  None (edit)
Description Iskatel 2016-01-22 15:52:08 EST
Description of problem:
Not built kernel module wl.ko

Version-Release number of selected component (if applicable):
akmod-wl-6.30.223.248-8.fc22.1.x86_64 from rRPMFusion repository

Errors in log /var/cache/akmods/wl/6.30.223.248-8.1-for-4.3.3-301.fc23.x86_64.failed.log:
2016/01/22 07:26:32 akmods: Building RPM using the command '/bin/akmodsbuild --target x86_64 --kernels 4.3.3-301.fc23.x86_64 /usr/src/akmods/wl-kmod.latest'
make: *** [_module_/tmp/akmodsbuild.ZxhSPxXx/BUILD/wl-kmod-6.30.223.248/_kmod_build_4.3.3-301.fc23.x86_64] Error 2
make: Leaving directory '/usr/src/kernels/4.3.3-301.fc23.x86_64'
error: Bad exit status from /var/tmp/rpm-tmp.bpkXcs (%build)


RPM build errors:
    user mockbuild does not exist - using root
    group mockbuild does not exist - using root
    user mockbuild does not exist - using root
    group mockbuild does not exist - using root
    user mockbuild does not exist - using root
    group mockbuild does not exist - using root
    user mockbuild does not exist - using root
    group mockbuild does not exist - using root
    user mockbuild does not exist - using root
    group mockbuild does not exist - using root
    user mockbuild does not exist - using root
    group mockbuild does not exist - using root
    user mockbuild does not exist - using root
    group mockbuild does not exist - using root
    user mockbuild does not exist - using root
    group mockbuild does not exist - using root
    user mockbuild does not exist - using root
    group mockbuild does not exist - using root
    user mockbuild does not exist - using root
    group mockbuild does not exist - using root
    user mockbuild does not exist - using root
    group mockbuild does not exist - using root
    user mockbuild does not exist - using root
    group mockbuild does not exist - using root
    user mockbuild does not exist - using root
    group mockbuild does not exist - using root
    user mockbuild does not exist - using root
    group mockbuild does not exist - using root
    Bad exit status from /var/tmp/rpm-tmp.bpkXcs (%build)
2016/01/22 07:26:48 akmodsbuild: * Rebuilding /usr/src/akmods/wl-kmod.latest for kernel(s) 4.3.3-301.fc23.x86_64: warning: user mockbuild does not exist - using root
2016/01/22 07:26:48 akmodsbuild: warning: group mockbuild does not exist - using root
2016/01/22 07:26:48 akmodsbuild: warning: user mockbuild does not exist - using root
2016/01/22 07:26:48 akmodsbuild: warning: group mockbuild does not exist - using root
2016/01/22 07:26:48 akmodsbuild: warning: user mockbuild does not exist - using root
2016/01/22 07:26:48 akmodsbuild: warning: group mockbuild does not exist - using root
2016/01/22 07:26:48 akmodsbuild: warning: user mockbuild does not exist - using root
2016/01/22 07:26:48 akmodsbuild: warning: group mockbuild does not exist - using root
2016/01/22 07:26:48 akmodsbuild: warning: user mockbuild does not exist - using root
2016/01/22 07:26:48 akmodsbuild: warning: group mockbuild does not exist - using root
2016/01/22 07:26:48 akmodsbuild: warning: user mockbuild does not exist - using root
2016/01/22 07:26:48 akmodsbuild: warning: group mockbuild does not exist - using root
2016/01/22 07:26:48 akmodsbuild: warning: user mockbuild does not exist - using root
2016/01/22 07:26:48 akmodsbuild: warning: group mockbuild does not exist - using root
2016/01/22 07:26:48 akmodsbuild: warning: user mockbuild does not exist - using root
2016/01/22 07:26:48 akmodsbuild: warning: group mockbuild does not exist - using root
2016/01/22 07:26:48 akmodsbuild: warning: user mockbuild does not exist - using root
2016/01/22 07:26:48 akmodsbuild: warning: group mockbuild does not exist - using root
2016/01/22 07:26:48 akmodsbuild: warning: user mockbuild does not exist - using root
2016/01/22 07:26:48 akmodsbuild: warning: group mockbuild does not exist - using root
2016/01/22 07:26:48 akmodsbuild: warning: user mockbuild does not exist - using root
2016/01/22 07:26:48 akmodsbuild: warning: group mockbuild does not exist - using root
2016/01/22 07:26:48 akmodsbuild: warning: user mockbuild does not exist - using root
2016/01/22 07:26:48 akmodsbuild: warning: group mockbuild does not exist - using root
2016/01/22 07:26:48 akmodsbuild: warning: user mockbuild does not exist - using root
2016/01/22 07:26:48 akmodsbuild: warning: group mockbuild does not exist - using root
2016/01/22 07:26:48 akmodsbuild: warning: user mockbuild does not exist - using root
2016/01/22 07:26:48 akmodsbuild: warning: group mockbuild does not exist - using root
2016/01/22 07:26:48 akmodsbuild: Installing /usr/src/akmods/wl-kmod.latest
2016/01/22 07:26:48 akmodsbuild: Building target platforms: x86_64
2016/01/22 07:26:48 akmodsbuild: Building for target x86_64
2016/01/22 07:26:48 akmodsbuild: Executing(%prep): /bin/sh -e /var/tmp/rpm-tmp.xfa9Lq
2016/01/22 07:26:48 akmodsbuild: + umask 022
2016/01/22 07:26:48 akmodsbuild: + cd /tmp/akmodsbuild.ZxhSPxXx//BUILD
2016/01/22 07:26:48 akmodsbuild: + kmodtool --target x86_64 --repo rpmfusion --kmodname wl-kmod --filterfile /tmp/akmodsbuild.ZxhSPxXx/SOURCES/wl-kmod-kmodtool-excludekernel-filterfile --for-kernels 4.3.3-301.fc23.x86_64
2016/01/22 07:26:48 akmodsbuild: %package       -n kmod-wl-4.3.3-301.fc23.x86_64
2016/01/22 07:26:48 akmodsbuild: Summary:          wl kernel module(s) for 4.3.3-301.fc23.x86_64
2016/01/22 07:26:48 akmodsbuild: Group:            System Environment/Kernel
2016/01/22 07:26:48 akmodsbuild: Provides:         kernel-modules-for-kernel = 4.3.3-301.fc23.x86_64
2016/01/22 07:26:48 akmodsbuild: Provides:         wl-kmod = %{?epoch:%{epoch}:}%{version}-%{release}
2016/01/22 07:26:48 akmodsbuild: Requires:         wl-kmod-common >= %{?epoch:%{epoch}:}%{version}
2016/01/22 07:26:48 akmodsbuild: Requires(post):   /usr/sbin/depmod
2016/01/22 07:26:48 akmodsbuild: Requires(postun): /usr/sbin/depmod
2016/01/22 07:26:48 akmodsbuild: Requires:         kernel-uname-r = 4.3.3-301.fc23.x86_64
2016/01/22 07:26:48 akmodsbuild: BuildRequires:	  kernel-devel-uname-r = 4.3.3-301.fc23.x86_64
2016/01/22 07:26:48 akmodsbuild: %post          -n kmod-wl-4.3.3-301.fc23.x86_64
2016/01/22 07:26:48 akmodsbuild: /usr/sbin/depmod -aeF /boot/System.map-4.3.3-301.fc23.x86_64 4.3.3-301.fc23.x86_64 > /dev/null || :
2016/01/22 07:26:48 akmodsbuild: %postun        -n kmod-wl-4.3.3-301.fc23.x86_64
2016/01/22 07:26:48 akmodsbuild: /usr/sbin/depmod  -aF /boot/System.map-4.3.3-301.fc23.x86_64 4.3.3-301.fc23.x86_64 &> /dev/null || :
2016/01/22 07:26:48 akmodsbuild: 
2016/01/22 07:26:48 akmodsbuild: %description  -n kmod-wl-4.3.3-301.fc23.x86_64
2016/01/22 07:26:48 akmodsbuild: This package provides the wl kernel modules built for the Linux
2016/01/22 07:26:48 akmodsbuild: kernel 4.3.3-301.fc23.x86_64 for the %{_target_cpu} family of processors.
2016/01/22 07:26:48 akmodsbuild: %files        -n kmod-wl-4.3.3-301.fc23.x86_64
2016/01/22 07:26:48 akmodsbuild: %defattr(644,root,root,755)
2016/01/22 07:26:48 akmodsbuild: %dir /usr/lib/modules/4.3.3-301.fc23.x86_64/extra
2016/01/22 07:26:48 akmodsbuild: /usr/lib/modules/4.3.3-301.fc23.x86_64/extra/wl/
2016/01/22 07:26:48 akmodsbuild: 
2016/01/22 07:26:48 akmodsbuild: 
2016/01/22 07:26:48 akmodsbuild: 
2016/01/22 07:26:48 akmodsbuild: %global kmodinstdir_prefix  /usr/lib/modules/
2016/01/22 07:26:48 akmodsbuild: %global kmodinstdir_postfix /extra/wl/
2016/01/22 07:26:48 akmodsbuild: %global kernel_versions     4.3.3-301.fc23.x86_64___%{_usrsrc}/kernels/4.3.3-301.fc23.x86_64
2016/01/22 07:26:48 akmodsbuild: 
2016/01/22 07:26:48 akmodsbuild: + cd /tmp/akmodsbuild.ZxhSPxXx/BUILD
2016/01/22 07:26:48 akmodsbuild: + rm -rf wl-kmod-6.30.223.248
2016/01/22 07:26:48 akmodsbuild: + /usr/bin/mkdir -p wl-kmod-6.30.223.248
2016/01/22 07:26:48 akmodsbuild: + cd wl-kmod-6.30.223.248
2016/01/22 07:26:48 akmodsbuild: + /usr/bin/chmod -Rf a+rX,u+w,g-w,o-w .
2016/01/22 07:26:48 akmodsbuild: + mkdir wl-kmod-6.30.223.248-src
2016/01/22 07:26:48 akmodsbuild: + pushd wl-kmod-6.30.223.248-src
2016/01/22 07:26:48 akmodsbuild: /tmp/akmodsbuild.ZxhSPxXx/BUILD/wl-kmod-6.30.223.248/wl-kmod-6.30.223.248-src /tmp/akmodsbuild.ZxhSPxXx/BUILD/wl-kmod-6.30.223.248
2016/01/22 07:26:48 akmodsbuild: + tar xzf /tmp/akmodsbuild.ZxhSPxXx/SOURCES/hybrid-v35_64-nodebug-pcoem-6_30_223_248.tar.gz
2016/01/22 07:26:48 akmodsbuild: + echo 'Patch #0 (wl-kmod-001_license.patch):'
2016/01/22 07:26:48 akmodsbuild: Patch #0 (wl-kmod-001_license.patch):
2016/01/22 07:26:48 akmodsbuild: + /usr/bin/patch -p1 -b --suffix .license --fuzz=0
2016/01/22 07:26:48 akmodsbuild: patching file src/wl/sys/wl_linux.c
2016/01/22 07:26:48 akmodsbuild: + echo 'Patch #1 (wl-kmod-002_wext_workaround.patch):'
2016/01/22 07:26:48 akmodsbuild: Patch #1 (wl-kmod-002_wext_workaround.patch):
2016/01/22 07:26:48 akmodsbuild: + /usr/bin/patch -p1 -b --suffix .wext_workaround.patch --fuzz=0
2016/01/22 07:26:48 akmodsbuild: patching file Makefile
2016/01/22 07:26:48 akmodsbuild: + echo 'Patch #2 (wl-kmod-003_kernel_3.8.patch):'
2016/01/22 07:26:48 akmodsbuild: Patch #2 (wl-kmod-003_kernel_3.8.patch):
2016/01/22 07:26:48 akmodsbuild: + /usr/bin/patch -p1 -b --suffix .kernel-3.8 --fuzz=0
2016/01/22 07:26:48 akmodsbuild: patching file src/wl/sys/wl_linux.c
2016/01/22 07:26:48 akmodsbuild: + echo 'Patch #3 (wl-kmod-004_kernel_3.15.patch):'
2016/01/22 07:26:48 akmodsbuild: Patch #3 (wl-kmod-004_kernel_3.15.patch):
2016/01/22 07:26:48 akmodsbuild: + /usr/bin/patch -p1 -b --suffix .kernel-3.15 --fuzz=0
2016/01/22 07:26:48 akmodsbuild: patching file src/wl/sys/wl_cfg80211_hybrid.c
2016/01/22 07:26:48 akmodsbuild: + echo 'Patch #4 (wl-kmod-005_gcc_4.9.patch):'
2016/01/22 07:26:48 akmodsbuild: Patch #4 (wl-kmod-005_gcc_4.9.patch):
2016/01/22 07:26:48 akmodsbuild: + /usr/bin/patch -p1 -b --suffix .gcc-4.9 --fuzz=0
2016/01/22 07:26:48 akmodsbuild: patching file src/wl/sys/wl_linux.c
2016/01/22 07:26:48 akmodsbuild: + echo 'Patch #5 (wl-kmod-006_kernel_3.16.patch):'
2016/01/22 07:26:48 akmodsbuild: Patch #5 (wl-kmod-006_kernel_3.16.patch):
2016/01/22 07:26:48 akmodsbuild: + /usr/bin/patch -p1 -b --suffix .kernel-3.16 --fuzz=0
2016/01/22 07:26:48 akmodsbuild: patching file src/wl/sys/wl_cfg80211_hybrid.c
2016/01/22 07:26:48 akmodsbuild: + echo 'Patch #6 (wl-kmod-007_kernel_3.17.patch):'
2016/01/22 07:26:48 akmodsbuild: Patch #6 (wl-kmod-007_kernel_3.17.patch):
2016/01/22 07:26:48 akmodsbuild: + /usr/bin/patch -p1 -b --suffix .kernel-3.17 --fuzz=0
2016/01/22 07:26:48 akmodsbuild: patching file src/wl/sys/wl_linux.c
2016/01/22 07:26:48 akmodsbuild: + echo 'Patch #7 (wl-kmod-008_kernel_3.18.patch):'
2016/01/22 07:26:48 akmodsbuild: Patch #7 (wl-kmod-008_kernel_3.18.patch):
2016/01/22 07:26:48 akmodsbuild: + /usr/bin/patch -p1 -b --suffix .kernel-3.18 --fuzz=0
2016/01/22 07:26:48 akmodsbuild: patching file src/wl/sys/wl_cfg80211_hybrid.c
2016/01/22 07:26:48 akmodsbuild: + echo 'Patch #8 (wl-kmod-009_kernel_3.18_null_pointer.patch):'
2016/01/22 07:26:48 akmodsbuild: Patch #8 (wl-kmod-009_kernel_3.18_null_pointer.patch):
2016/01/22 07:26:48 akmodsbuild: + /usr/bin/patch -p1 -b --suffix .kernel-3.18_null_pointer --fuzz=0
2016/01/22 07:26:48 akmodsbuild: patching file src/wl/sys/wl_linux.c
2016/01/22 07:26:48 akmodsbuild: + echo 'Patch #9 (wl-kmod-010_kernel_4.0.patch):'
2016/01/22 07:26:48 akmodsbuild: Patch #9 (wl-kmod-010_kernel_4.0.patch):
2016/01/22 07:26:48 akmodsbuild: + /usr/bin/patch -p1 -b --suffix .kernel-4.0 --fuzz=0
2016/01/22 07:26:48 akmodsbuild: patching file src/wl/sys/wl_cfg80211_hybrid.c
2016/01/22 07:26:48 akmodsbuild: + popd
2016/01/22 07:26:48 akmodsbuild: /tmp/akmodsbuild.ZxhSPxXx/BUILD/wl-kmod-6.30.223.248
2016/01/22 07:26:48 akmodsbuild: + for kernel_version in 4.3.3-301.fc23.x86_64___/usr/src/kernels/4.3.3-301.fc23.x86_64
2016/01/22 07:26:48 akmodsbuild: + cp -a wl-kmod-6.30.223.248-src _kmod_build_4.3.3-301.fc23.x86_64
2016/01/22 07:26:48 akmodsbuild: + exit 0
2016/01/22 07:26:48 akmodsbuild: Executing(%build): /bin/sh -e /var/tmp/rpm-tmp.bpkXcs
2016/01/22 07:26:48 akmodsbuild: + umask 022
2016/01/22 07:26:48 akmodsbuild: + cd /tmp/akmodsbuild.ZxhSPxXx//BUILD
2016/01/22 07:26:48 akmodsbuild: + cd wl-kmod-6.30.223.248
2016/01/22 07:26:48 akmodsbuild: + for kernel_version in 4.3.3-301.fc23.x86_64___/usr/src/kernels/4.3.3-301.fc23.x86_64
2016/01/22 07:26:48 akmodsbuild: + pushd _kmod_build_4.3.3-301.fc23.x86_64
2016/01/22 07:26:48 akmodsbuild: /tmp/akmodsbuild.ZxhSPxXx/BUILD/wl-kmod-6.30.223.248/_kmod_build_4.3.3-301.fc23.x86_64 /tmp/akmodsbuild.ZxhSPxXx/BUILD/wl-kmod-6.30.223.248
2016/01/22 07:26:48 akmodsbuild: ++ pwd
2016/01/22 07:26:48 akmodsbuild: + make -C /usr/src/kernels/4.3.3-301.fc23.x86_64 M=/tmp/akmodsbuild.ZxhSPxXx/BUILD/wl-kmod-6.30.223.248/_kmod_build_4.3.3-301.fc23.x86_64 modules
2016/01/22 07:26:48 akmodsbuild: make: Entering directory '/usr/src/kernels/4.3.3-301.fc23.x86_64'
2016/01/22 07:26:48 akmodsbuild: CFG80211 API is prefered for this kernel version
2016/01/22 07:26:48 akmodsbuild: Using CFG80211 API
2016/01/22 07:26:48 akmodsbuild: CC [M]  /tmp/akmodsbuild.ZxhSPxXx/BUILD/wl-kmod-6.30.223.248/_kmod_build_4.3.3-301.fc23.x86_64/src/shared/linux_osl.o
2016/01/22 07:26:48 akmodsbuild: CC [M]  /tmp/akmodsbuild.ZxhSPxXx/BUILD/wl-kmod-6.30.223.248/_kmod_build_4.3.3-301.fc23.x86_64/src/wl/sys/wl_linux.o
2016/01/22 07:26:48 akmodsbuild: CC [M]  /tmp/akmodsbuild.ZxhSPxXx/BUILD/wl-kmod-6.30.223.248/_kmod_build_4.3.3-301.fc23.x86_64/src/wl/sys/wl_iw.o
2016/01/22 07:26:48 akmodsbuild: CC [M]  /tmp/akmodsbuild.ZxhSPxXx/BUILD/wl-kmod-6.30.223.248/_kmod_build_4.3.3-301.fc23.x86_64/src/wl/sys/wl_cfg80211_hybrid.o
2016/01/22 07:26:48 akmodsbuild: /tmp/akmodsbuild.ZxhSPxXx/BUILD/wl-kmod-6.30.223.248/_kmod_build_4.3.3-301.fc23.x86_64/src/wl/sys/wl_cfg80211_hybrid.c: In function 'wl_notify_connect_status':
2016/01/22 07:26:48 akmodsbuild: /tmp/akmodsbuild.ZxhSPxXx/BUILD/wl-kmod-6.30.223.248/_kmod_build_4.3.3-301.fc23.x86_64/src/wl/sys/wl_cfg80211_hybrid.c:2087:4: error: too few arguments to function 'cfg80211_disconnected'
2016/01/22 07:26:48 akmodsbuild: cfg80211_disconnected(ndev, 0, NULL, 0, GFP_KERNEL);
2016/01/22 07:26:48 akmodsbuild: ^
2016/01/22 07:26:48 akmodsbuild: In file included from /tmp/akmodsbuild.ZxhSPxXx/BUILD/wl-kmod-6.30.223.248/_kmod_build_4.3.3-301.fc23.x86_64/src/wl/sys/wl_cfg80211_hybrid.c:33:0:
2016/01/22 07:26:48 akmodsbuild: include/net/cfg80211.h:4583:6: note: declared here
2016/01/22 07:26:48 akmodsbuild: void cfg80211_disconnected(struct net_device *dev, u16 reason,
2016/01/22 07:26:48 akmodsbuild: ^
2016/01/22 07:26:48 akmodsbuild: scripts/Makefile.build:258: recipe for target '/tmp/akmodsbuild.ZxhSPxXx/BUILD/wl-kmod-6.30.223.248/_kmod_build_4.3.3-301.fc23.x86_64/src/wl/sys/wl_cfg80211_hybrid.o' failed
2016/01/22 07:26:48 akmodsbuild: make[1]: *** [/tmp/akmodsbuild.ZxhSPxXx/BUILD/wl-kmod-6.30.223.248/_kmod_build_4.3.3-301.fc23.x86_64/src/wl/sys/wl_cfg80211_hybrid.o] Error 1
2016/01/22 07:26:48 akmodsbuild: Makefile:1382: recipe for target '_module_/tmp/akmodsbuild.ZxhSPxXx/BUILD/wl-kmod-6.30.223.248/_kmod_build_4.3.3-301.fc23.x86_64' failed
2016/01/22 07:26:48 akmodsbuild: make: *** [_module_/tmp/akmodsbuild.ZxhSPxXx/BUILD/wl-kmod-6.30.223.248/_kmod_build_4.3.3-301.fc23.x86_64] Error 2
2016/01/22 07:26:48 akmodsbuild: make: Leaving directory '/usr/src/kernels/4.3.3-301.fc23.x86_64'
2016/01/22 07:26:48 akmodsbuild: error: Bad exit status from /var/tmp/rpm-tmp.bpkXcs (%build)
2016/01/22 07:26:48 akmodsbuild: 
2016/01/22 07:26:48 akmodsbuild: 
2016/01/22 07:26:48 akmodsbuild: RPM build errors:
2016/01/22 07:26:48 akmodsbuild: user mockbuild does not exist - using root
2016/01/22 07:26:48 akmodsbuild: group mockbuild does not exist - using root
2016/01/22 07:26:48 akmodsbuild: user mockbuild does not exist - using root
2016/01/22 07:26:48 akmodsbuild: group mockbuild does not exist - using root
2016/01/22 07:26:48 akmodsbuild: user mockbuild does not exist - using root
2016/01/22 07:26:48 akmodsbuild: group mockbuild does not exist - using root
2016/01/22 07:26:48 akmodsbuild: user mockbuild does not exist - using root
2016/01/22 07:26:48 akmodsbuild: group mockbuild does not exist - using root
2016/01/22 07:26:48 akmodsbuild: user mockbuild does not exist - using root
2016/01/22 07:26:48 akmodsbuild: group mockbuild does not exist - using root
2016/01/22 07:26:48 akmodsbuild: user mockbuild does not exist - using root
2016/01/22 07:26:48 akmodsbuild: group mockbuild does not exist - using root
2016/01/22 07:26:48 akmodsbuild: user mockbuild does not exist - using root
2016/01/22 07:26:48 akmodsbuild: group mockbuild does not exist - using root
2016/01/22 07:26:48 akmodsbuild: user mockbuild does not exist - using root
2016/01/22 07:26:48 akmodsbuild: group mockbuild does not exist - using root
2016/01/22 07:26:48 akmodsbuild: user mockbuild does not exist - using root
2016/01/22 07:26:48 akmodsbuild: group mockbuild does not exist - using root
2016/01/22 07:26:48 akmodsbuild: user mockbuild does not exist - using root
2016/01/22 07:26:48 akmodsbuild: group mockbuild does not exist - using root
2016/01/22 07:26:48 akmodsbuild: user mockbuild does not exist - using root
2016/01/22 07:26:48 akmodsbuild: group mockbuild does not exist - using root
2016/01/22 07:26:48 akmodsbuild: user mockbuild does not exist - using root
2016/01/22 07:26:48 akmodsbuild: group mockbuild does not exist - using root
2016/01/22 07:26:48 akmodsbuild: user mockbuild does not exist - using root
2016/01/22 07:26:48 akmodsbuild: group mockbuild does not exist - using root
2016/01/22 07:26:48 akmodsbuild: user mockbuild does not exist - using root
2016/01/22 07:26:48 akmodsbuild: group mockbuild does not exist - using root
2016/01/22 07:26:48 akmodsbuild: Bad exit status from /var/tmp/rpm-tmp.bpkXcs (%build)
2016/01/22 07:26:48 akmodsbuild: 
2016/01/22 07:26:48 akmods: Building rpms failed; see /var/cache/akmods/wl/6.30.223.248-8.1-for-4.3.3-301.fc23.x86_64.failed.log for details
Comment 1 Josh Boyer 2016-01-22 16:26:18 EST

*** This bug has been marked as a duplicate of bug 1301145 ***

Note You need to log in before you can comment on or make changes to this bug.