Bug 162554 - HWCERT: HCL Infosystems Ltd. Infiniti Xcel Line 1100 LB
HWCERT: HCL Infosystems Ltd. Infiniti Xcel Line 1100 LB
Status: CLOSED NOTABUG
Product: Red Hat Ready Certification Tests
Classification: Retired
Component: dumpster (Show other bugs)
1.0
x86_64 Linux
medium Severity medium
: ---
: ---
Assigned To: S. Lele
Will Woods
N.A.
HCL Infosystems Ltd.
:
Depends On:
Blocks:
  Show dependency treegraph
 
Reported: 2005-07-06 05:29 EDT by Gajalakshmi
Modified: 2007-11-16 02:46 EST (History)
4 users (show)

See Also:
Fixed In Version:
Doc Type: Bug Fix
Doc Text:
Story Points: ---
Clone Of:
Environment:
Last Closed: 2005-12-28 04:28:23 EST
Type: ---
Regression: ---
Mount Type: ---
Documentation: ---
CRM:
Verified Versions:
Category: ---
oVirt Team: ---
RHEL 7.3 requirements from Atomic Host:
Cloudforms Team: ---


Attachments (Terms of Use)
product spec sheet attached (68.00 KB, application/octet-stream)
2005-07-08 08:57 EDT, Gajalakshmi
no flags Details
32bit testing result (999.09 KB, application/octet-stream)
2005-07-27 09:00 EDT, Gajalakshmi
no flags Details

  None (edit)
Description Gajalakshmi 2005-07-06 05:29:23 EDT
Red Hat Hardware Certification Submitted

Product:        Red Hat Enterprise Linux
Version:        4
Make:           HCL Infosystems Ltd
Model:          Infiniti Xcel Line 1100 LB
Vendor:         HCL Infosystems Ltd.
Category:       Server
Reporter:       gajamano@hclinsys.com
Kernel Version: kernel-2.4.21-32.EL

File Uploaded:
rhr2-Infiniti_Xcel_Line_1100_LB-5_results-1.noarch.rpm
https://bugzilla.redhat.com/hwcert/data/rpms/96cebdeee56f14cd41dbc8e5dbd6f228/rhr2-Infiniti_Xcel_Line_1100_LB-5_results-1.noarch.rpm

Please note the following failures:
WARNING: Kickstart file not found for required tests check.
FAILED: No MEMORY found in limits file for platform 

0      INFO
1   PASSED   INFO
    PASSED   NETWORK
2   PASSED   USB
    PASSED   INFO
3   FAILED   INFO
    FAILED   CDROM
4   PASSED   INFO
    PASSED   CDROM
5   PASSED   INFO
    FAILED   AUDIO
    PASSED   VIDEO
    PASSED   STORAGE
    PASSED   FLOPPY
    PASSED   MEMORY
    PASSED   CORE
Comment 1 Gajalakshmi 2005-07-08 08:57:14 EDT
Created attachment 116510 [details]
product spec sheet attached
Comment 2 Gajalakshmi 2005-07-19 03:11:45 EDT
Please update the status.
Comment 4 Kshitija Paratwar 2005-07-22 03:09:34 EDT
AUDIO : Driver not present. Test Failed.

CDROM : Please redo the testing with proper changes in tests.conf

CPU : Please Specify the CPU speed.

NETWORK : Network card present as per the logs is nVidia Corporation|CK8S
Ethernet Controller but you have mentioned it as Marvell PHY 88E1111(10/100/1000
BASE-T Ethernet). Also testing is done with 100Mbps speed.

Please Confirm.

Comment 5 Gajalakshmi 2005-07-25 09:18:26 EDT
New Hardware Certification Package Submitted
Kernel Version: kernel-2.4.21-32.EL

File Uploaded:
rhr2-Infiniti_Xcel_Line_1100_LB-Taroon_Update_5_results-1-bit64.noarch.rpm
https://bugzilla.redhat.com/hwcert/data/rpms/3f4469b975d8b8a15a870f724b209ec5/rhr2-Infiniti_Xcel_Line_1100_LB-Taroon_Update_5_results-1-bit64.noarch.rpm

Please note the following failures:
WARNING: Kickstart file not found for required tests check.
FAILED: Incorrect memory amount

0   PASSED   INFO
    PASSED   NETWORK
1   PASSED   INFO
    PASSED   CDROM
Comment 6 Gajalakshmi 2005-07-27 09:00:33 EDT
Created attachment 117188 [details]
32bit testing result
Comment 7 Gajalakshmi 2005-07-29 03:25:12 EDT
Please revert back
Comment 9 Gajalakshmi 2005-08-08 03:56:52 EDT
Please revert back
Comment 10 Gajalakshmi 2005-08-10 02:53:16 EDT
Please revert back
Comment 11 Gajalakshmi 2005-08-13 06:15:02 EDT
Please revert back

Comment 12 Gajalakshmi 2005-08-17 06:13:49 EDT
Please revert back
Comment 13 Gajalakshmi 2005-08-19 03:12:29 EDT
Please revert back

Comment 14 Kshitija Paratwar 2005-09-02 02:25:47 EDT
Please check the 32bit result rpm which you have uploaded.
Comment 18 Kshitija Paratwar 2005-09-28 06:52:35 EDT
Please check the 32bit result rpm which you have uploaded. It is not for 32bit arch.

Please upload the same for 32bit arch.
Comment 19 S. Lele 2005-09-30 08:15:08 EDT
Please upload 32-bit test result using hardware certification interface so that
test results can be reviewed.
Comment 20 S. Lele 2005-10-10 08:26:19 EDT
Please upload 32-bit test result using hardware certification interface so that
test results can be reviewed.

Comment 21 S. Lele 2005-10-14 02:03:44 EDT
Please upload 32-bit test result using hardware certification interface so that
test results can be reviewed.


Comment 22 Gajalakshmi 2005-10-14 03:05:20 EDT
We will get back to you once the testing is completed.
Comment 23 S. Lele 2005-10-24 09:34:28 EDT
As per comment#21, please upload 32-bit test result using hardware certification
interface so that test results can be reviewed.
Comment 24 S. Lele 2005-11-14 08:48:44 EST
Please action as per comment#21.

Comment 25 S. Lele 2005-12-06 04:03:16 EST
As per comment#21, please upload 32-bit test result using hardware certification
interface so that test results can be reviewed.
Comment 26 S. Lele 2005-12-19 06:40:30 EST
As per comment#21, please upload 32-bit test result using hardware certification
interface so that test results can be reviewed.
Comment 27 S. Lele 2005-12-26 07:57:12 EST
As per comment#21, please upload 32-bit test result using hardware certification
interface so that test results can be reviewed.

Comment 28 Gajalakshmi 2005-12-28 04:23:47 EST
Please close this issue. 
Comment 29 S. Lele 2005-12-28 04:28:23 EST
As per comment#28, this request will be closed.

Note You need to log in before you can comment on or make changes to this bug.