Bug 21683 - compile error
compile error
Status: CLOSED NOTABUG
Product: Red Hat Linux
Classification: Retired
Component: gcc (Show other bugs)
7.0
i386 Linux
medium Severity medium
: ---
: ---
Assigned To: Jakub Jelinek
David Lawrence
:
Depends On:
Blocks:
  Show dependency treegraph
 
Reported: 2000-12-04 11:22 EST by Thomas Ericsson
Modified: 2007-04-18 12:30 EDT (History)
0 users

See Also:
Fixed In Version:
Doc Type: Bug Fix
Doc Text:
Story Points: ---
Clone Of:
Environment:
Last Closed: 2000-12-04 11:22:40 EST
Type: ---
Regression: ---
Mount Type: ---
Documentation: ---
CRM:
Verified Versions:
Category: ---
oVirt Team: ---
RHEL 7.3 requirements from Atomic Host:
Cloudforms Team: ---


Attachments (Terms of Use)

  None (edit)
Description Thomas Ericsson 2000-12-04 11:22:37 EST
i cant compile programs from source.
i get an error message:

/usr/bin/ld: cannot find -ldb1
collect2: ld returned 1 exit status
make[2]: *** [ee] Error 1
make[1]: *** [all-recursive] Error 1
make: *** [all-recursive-am] Error 2

how do i fix it?
tompa_e@yahoo.com
Comment 1 Jakub Jelinek 2000-12-04 12:26:50 EST
Install db1-devel package and all should be fine.

Note You need to log in before you can comment on or make changes to this bug.