Bug 434277 - readahead failed massrebuild attempt for GCC 4.3
Summary: readahead failed massrebuild attempt for GCC 4.3
Keywords:
Status: CLOSED RAWHIDE
Alias: None
Product: Fedora
Classification: Fedora
Component: readahead
Version: rawhide
Hardware: All
OS: Linux
medium
medium
Target Milestone: ---
Assignee: Karel Zak
QA Contact: Fedora Extras Quality Assurance
URL:
Whiteboard:
Depends On:
Blocks: gcc43errors
TreeView+ depends on / blocked
 
Reported: 2008-02-22 15:55 UTC by Jesse Keating
Modified: 2013-01-10 03:03 UTC (History)
2 users (show)

Fixed In Version:
Doc Type: Bug Fix
Doc Text:
Clone Of:
Environment:
Last Closed: 2008-03-03 14:20:33 UTC
Type: ---


Attachments (Terms of Use)

Description Jesse Keating 2008-02-22 15:55:17 UTC
This is an automatically filed bug for a failed rebuild attempt for GCC 4.3.

http://fedoraproject.org/wiki/JesseKeating/gcc43MassRebuildProposal

Please verify why this build failed and fix it.
http://koji.fedoraproject.org/koji/taskinfo?taskID=441574
Exit code was 1, check the build.log for the failed buildArch task.

Comment 1 Jon Stanley 2008-02-28 23:08:29 UTC
scratch build 477170

Comment 2 Jon Stanley 2008-02-29 00:47:46 UTC
readahead-collector.c: In function 'list_write':
readahead-collector.c:965: error: 'PATH_MAX' undeclared (first use in this function)
readahead-collector.c:965: error: (Each undeclared identifier is reported only once
readahead-collector.c:965: error: for each function it appears in.)
readahead-collector.c:965: warning: unused variable 'filename'
readahead-collector.c: In function 'parse_events':
readahead-collector.c:1020: error: 'PATH_MAX' undeclared (first use in this
function)
readahead-collector.c:1054: warning: unused variable 'buff'
readahead-collector.c:1021: warning: unused variable 'cwd'
readahead-collector.c:1020: warning: unused variable 'path'
readahead-collector.c: In function 'myrealpath':
readahead-collector.c:1128: error: 'PATH_MAX' undeclared (first use in this
function)
readahead-collector.c:1128: warning: unused variable 'link_path'
make[2]: *** [readahead-collector.o] Error 1


Comment 3 Karel Zak 2008-03-03 14:20:33 UTC
487003 build (dist-f9, devel:readahead-1_4_2-5_fc9) completed successfully


Note You need to log in before you can comment on or make changes to this bug.