Bug 436617 - Build fails in rawhide
Build fails in rawhide
Product: Fedora
Classification: Fedora
Component: control-center (Show other bugs)
All Linux
low Severity low
: ---
: ---
Assigned To: Control Center Maintainer
Fedora Extras Quality Assurance
Depends On:
  Show dependency treegraph
Reported: 2008-03-08 07:37 EST by Kjartan Maraas
Modified: 2008-03-11 11:15 EDT (History)
1 user (show)

See Also:
Fixed In Version:
Doc Type: Bug Fix
Doc Text:
Story Points: ---
Clone Of:
Last Closed: 2008-03-11 11:15:06 EDT
Type: ---
Regression: ---
Mount Type: ---
Documentation: ---
Verified Versions:
Category: ---
oVirt Team: ---
RHEL 7.3 requirements from Atomic Host:
Cloudforms Team: ---

Attachments (Terms of Use)

  None (edit)
Description Kjartan Maraas 2008-03-08 07:37:01 EST
Description of problem:

Lately control-center build fails when building from svn on rawhide. I don't
think anyone has reported this on non-fedora distros.

make  all-am
make[3]: Entering directory `/home/kmaraas/cvs/gnome/gnome-control-center/libslab'
/bin/sh ../libtool --tag=CC   --mode=link gcc  -g -O0 -march=core2 -Wall
-version-info   -o libslab.la  nld-marshal.lo nld-marshal.lo app-resizer.lo
app-shell.lo app-shell-startup.lo application-tile.lo bookmark-agent.lo
directory-tile.lo document-tile.lo double-click-detector.lo
libslab-bookmarkfile.lo egg-recent-item.lo egg-recent-model.lo gnome-utils.lo
libslab-utils.lo nameplate-tile.lo search-bar.lo search-context-picker.lo
search-entry.lo shell-window.lo slab-gnome-util.lo slab-section.lo
system-tile.lo themed-icon.lo tile-action.lo tile.lo -pthread -L/opt/gnome2/lib
-lgnome-desktop-2 -lstartup-notification-1 -lrsvg-2 -lgnome-menu -leel-2
-lgio-2.0 -lgnomeui-2 -lSM -lICE -lgailutil -lglade-2.0 -lbonoboui-2
-lgnomevfs-2 -lgnomecanvas-2 -lgnome-2 -lpopt -lbonobo-2 -lbonobo-activation
-lORBit-2 -lart_lgpl_2 -lgconf-2 -lgthread-2.0 -lrt -lgtk-x11-2.0 -lxml2
-lgdk-x11-2.0 -latk-1.0 -lgdk_pixbuf-2.0 -lpangocairo-1.0 -lpango-1.0 -lcairo
-lgobject-2.0 -lgmodule-2.0 -ldl -lglib-2.0   
libtool: link: you must specify an output file
Try `libtool --help --mode=link' for more information.
make[3]: *** [libslab.la] Error 1
make[3]: Leaving directory `/home/kmaraas/cvs/gnome/gnome-control-center/libslab'
make[2]: *** [all] Error 2
make[2]: Leaving directory `/home/kmaraas/cvs/gnome/gnome-control-center/libslab'
make[1]: *** [all-recursive] Error 1
make[1]: Leaving directory `/home/kmaraas/cvs/gnome/gnome-control-center'
make: *** [all] Error 2
[kmaraas@localhost gnome-control-center]$ 

Version-Release number of selected component (if applicable):

How reproducible:
Every time.

Steps to Reproduce:
Actual results:

Expected results:

Additional info:
Comment 1 Matthias Clasen 2008-03-11 11:15:06 EDT
I've built control-center 2.22.0 successfully last night.

Note You need to log in before you can comment on or make changes to this bug.