Bug 598713 - Many GLibC self-test errors; packages build anyway
Many GLibC self-test errors; packages build anyway
Status: CLOSED ERRATA
Product: Fedora
Classification: Fedora
Component: glibc (Show other bugs)
13
i686 Linux
low Severity medium
: ---
: ---
Assigned To: Andreas Schwab
Fedora Extras Quality Assurance
:
Depends On:
Blocks:
  Show dependency treegraph
 
Reported: 2010-06-01 17:31 EDT by Steve Snyder
Modified: 2010-06-10 08:11 EDT (History)
2 users (show)

See Also:
Fixed In Version: glibc-2.12-2
Doc Type: Bug Fix
Doc Text:
Story Points: ---
Clone Of:
Environment:
Last Closed: 2010-06-10 08:11:18 EDT
Type: ---
Regression: ---
Mount Type: ---
Documentation: ---
CRM:
Verified Versions:
Category: ---
oVirt Team: ---
RHEL 7.3 requirements from Atomic Host:
Cloudforms Team: ---


Attachments (Terms of Use)

  None (edit)
Description Steve Snyder 2010-06-01 17:31:08 EDT
Description of problem:

In the course of building the GLibC v2.12 i686 binary packages many tests fail, yet the packages are built anyway.

Version-Release number of selected component (if applicable):

2.12-1

How reproducible:

Always

Steps to Reproduce:

1. On an i686 system do:
2.   rpm -ivh glibc-2.12-1.src.rpm
3.   rpmbuild -bb SPECS/glibc.spec

  
Actual results:

$ grep "Error 1" BUILD/glibc-2.12-2-gc4ccff1/build-i686-linuxnptl-nosegneg/check.log BUILD/glibc-2.12-2-gc4ccff1/build-i686-linuxnptl/check.log
BUILD/glibc-2.12-2-gc4ccff1/build-i686-linuxnptl-nosegneg/check.log:make[2]: *** [/home/rpmbuild/rpmbuild/BUILD/glibc-2.12-2-gc4ccff1/build-i686-linuxnptl-nosegneg/nptl/tst-_res1] Error 1
BUILD/glibc-2.12-2-gc4ccff1/build-i686-linuxnptl-nosegneg/check.log:make[2]: *** [/home/rpmbuild/rpmbuild/BUILD/glibc-2.12-2-gc4ccff1/build-i686-linuxnptl-nosegneg/rt/tst-cpuclock2.out] Error 1
BUILD/glibc-2.12-2-gc4ccff1/build-i686-linuxnptl-nosegneg/check.log:make[2]: *** [/home/rpmbuild/rpmbuild/BUILD/glibc-2.12-2-gc4ccff1/build-i686-linuxnptl-nosegneg/rtkaio/tst-cpuclock2.out] Error 1
BUILD/glibc-2.12-2-gc4ccff1/build-i686-linuxnptl-nosegneg/check.log:make[2]: *** [/home/rpmbuild/rpmbuild/BUILD/glibc-2.12-2-gc4ccff1/build-i686-linuxnptl-nosegneg/elf/tst-tls10] Error 1
BUILD/glibc-2.12-2-gc4ccff1/build-i686-linuxnptl-nosegneg/check.log:make[2]: *** [/home/rpmbuild/rpmbuild/BUILD/glibc-2.12-2-gc4ccff1/build-i686-linuxnptl-nosegneg/elf/tst-tls11] Error 1
BUILD/glibc-2.12-2-gc4ccff1/build-i686-linuxnptl-nosegneg/check.log:make[2]: *** [/home/rpmbuild/rpmbuild/BUILD/glibc-2.12-2-gc4ccff1/build-i686-linuxnptl-nosegneg/elf/tst-tls12] Error 1
BUILD/glibc-2.12-2-gc4ccff1/build-i686-linuxnptl/check.log:make[2]: *** [/home/rpmbuild/rpmbuild/BUILD/glibc-2.12-2-gc4ccff1/build-i686-linuxnptl/nptl/tst-_res1] Error 1
BUILD/glibc-2.12-2-gc4ccff1/build-i686-linuxnptl/check.log:make[2]: *** [/home/rpmbuild/rpmbuild/BUILD/glibc-2.12-2-gc4ccff1/build-i686-linuxnptl/rt/tst-cpuclock2.out] Error 1
BUILD/glibc-2.12-2-gc4ccff1/build-i686-linuxnptl/check.log:make[2]: *** [/home/rpmbuild/rpmbuild/BUILD/glibc-2.12-2-gc4ccff1/build-i686-linuxnptl/elf/tst-tls10] Error 1
BUILD/glibc-2.12-2-gc4ccff1/build-i686-linuxnptl/check.log:make[2]: *** [/home/rpmbuild/rpmbuild/BUILD/glibc-2.12-2-gc4ccff1/build-i686-linuxnptl/elf/tst-tls11] Error 1
BUILD/glibc-2.12-2-gc4ccff1/build-i686-linuxnptl/check.log:make[2]: *** [/home/rpmbuild/rpmbuild/BUILD/glibc-2.12-2-gc4ccff1/build-i686-linuxnptl/elf/tst-tls12] Error 1


Expected results:

If the failing test are valid, then the code should be fixed to resolve these errors.  If the tests themselves are invalid then they should be removed from the self-test suite.

Additional info:

More info on the nature of the errors:

/usr/bin/ld: note: '_res' is defined in DSO /home/rpmbuild/rpmbuild/BUILD/glibc-2.12-2-gc4ccff1/build-i686-linuxnptl/nptl/tst-_res1mod1.so so try adding it to the linker command line
/usr/bin/ld: note: 'f6a' is defined in DSO /home/rpmbuild/rpmbuild/BUILD/glibc-2.12-2-gc4ccff1/build-i686-linuxnptl/elf/tst-tlsmod7.so so try adding it to the linker command line
/usr/bin/ld: note: 'f6a' is defined in DSO /home/rpmbuild/rpmbuild/BUILD/glibc-2.12-2-gc4ccff1/build-i686-linuxnptl/elf/tst-tlsmod9.so so try adding it to the linker command line
/usr/bin/ld: note: 'a1' is defined in DSO /home/rpmbuild/rpmbuild/BUILD/glibc-2.12-2-gc4ccff1/build-i686-linuxnptl/elf/tst-tlsmod11.so so try adding it to the linker command line
/usr/bin/ld: note: '_res' is defined in DSO /home/rpmbuild/rpmbuild/BUILD/glibc-2.12-2-gc4ccff1/build-i686-linuxnptl-nosegneg/nptl/tst-_res1mod1.so so try adding it to the linker command line
/usr/bin/ld: note: 'f6a' is defined in DSO /home/rpmbuild/rpmbuild/BUILD/glibc-2.12-2-gc4ccff1/build-i686-linuxnptl-nosegneg/elf/tst-tlsmod7.so so try adding it to the linker command line
/usr/bin/ld: note: 'f6a' is defined in DSO /home/rpmbuild/rpmbuild/BUILD/glibc-2.12-2-gc4ccff1/build-i686-linuxnptl-nosegneg/elf/tst-tlsmod9.so so try adding it to the linker command line
/usr/bin/ld: note: 'a1' is defined in DSO /home/rpmbuild/rpmbuild/BUILD/glibc-2.12-2-gc4ccff1/build-i686-linuxnptl-nosegneg/elf/tst-tlsmod11.so so try adding it to the linker command line

Note You need to log in before you can comment on or make changes to this bug.