Bug 739580 - ami-03f3ae46 6.1 i386 us-west-1
Summary: ami-03f3ae46 6.1 i386 us-west-1
Keywords:
Status: CLOSED CURRENTRELEASE
Alias: None
Product: Cloud Image Validation
Classification: Red Hat
Component: images
Version: RHEL6.1
Hardware: x86_64
OS: Unspecified
unspecified
unspecified
Target Milestone: ---
Assignee: wes hayutin
QA Contact:
URL:
Whiteboard:
Depends On:
Blocks:
TreeView+ depends on / blocked
 
Reported: 2011-09-19 14:50 UTC by Kedar Bidarkar
Modified: 2011-12-16 15:32 UTC (History)
0 users

Fixed In Version:
Doc Type: Bug Fix
Doc Text:
Clone Of:
Environment:
Last Closed: 2011-12-16 15:32:03 UTC


Attachments (Terms of Use)

Description Kedar Bidarkar 2011-09-19 14:50:12 UTC

Comment 1 Kedar Bidarkar 2011-09-19 14:55:24 UTC
IMAGE ID= ami-03f3ae46_us-west-1_c1.medium
######################################################################################
# NEW TEST: ## Open a bugzilla
######################################################################################
######################################################################################
# NEW TEST: Fetching Host Details 
######################################################################################
This Host => ec2-204-236-152-39.us-west-1.compute.amazonaws.com with Image Id : ami-03f3ae46, is launched with Instance Id : i-6d924a2a , Instance Type : c1.medium and Arch : i386 in the Region : us-west-1b
This is a Hourly image
The Validate Signature is : aoNS/97b7EM4KzwdZuyJUZpBBJcSfKNZMEetwKkPKljHEqJjeYWrU73MWZj0Yf/LCuC7lfmKxAt8
B9zw1MaZ62tV+6GrFM4ZmwXIXPTyIpUUVd8QdVnLrBCAthYofYZKlzcCNq7w4qOUY1ScZYD8g7SJ
U+J5SekhmmT05lhP3JM=
/root/valid/src
ip-10-166-67-199
Red Hat Enterprise Linux Server release 6.1 (Santiago)
######################################################################################
# NEW TEST: The selected image has the version RHEL 6.1
######################################################################################
######################################################################################
# NEW TEST: ## Verify kernel name ... 
######################################################################################
COMMAND:  /bin/uname -s
RESULT: Linux 
EXPECTED RESULT: Linux
RETURN CODE: 0
PASS
######################################################################################
# NEW TEST: ## Verify latest installed kernel is running ... 
######################################################################################
RHEL VERSION IS 6
LATEST_RPM_KERNEL_VERSION=rpm -q kernel --last | head -n 1 |  cut -c 8-60 | cut -d ' ' -f 1
CURRENT_UNAME_KERNAL_VERSION=2.6.32-131.12.1.el6
assert latest rpm kernel = uname -r
COMMAND:  uname -r | sed  's/\(.*\)...../\1/'
RESULT: 2.6.32-131.12.1.el6 
EXPECTED RESULT: 2.6.32-131.12.1.el6
RETURN CODE: 0
PASS
######################################################################################
# NEW TEST: ## Verify latest kenerl is in /boot/grub/menu.1st ... 
######################################################################################
COMMAND:  cat /boot/grub/menu.lst | grep 2.6.32-131.12.1.el6
RESULT: title RHEL-6.1-Starter-EBS-i386-6 (2.6.32-131.12.1.el6.i686)
        kernel /boot/vmlinuz-2.6.32-131.12.1.el6.i686 ro root=LABEL=_/ 
        initrd /boot/initramfs-2.6.32-131.12.1.el6.i686.img 
EXPECTED RESULT: 
RETURN CODE: 0
PASS
######################################################################################
# NEW TEST: ## Verify operating system ... 
######################################################################################
COMMAND:  /bin/uname -o
RESULT: GNU/Linux 
EXPECTED RESULT: GNU/Linux
RETURN CODE: 0
PASS
######################################################################################
# NEW TEST: ## Verify /etc/sysconfig/kernel ... 
######################################################################################
COMMAND:  ls /etc/sysconfig/kernel
RESULT: /etc/sysconfig/kernel 
EXPECTED RESULT: 
RETURN CODE: 0
PASS
######################################################################################
# NEW TEST: ## Verify /etc/sysconfig/kernel contains UPDATEDEFAULT ... 
######################################################################################
COMMAND:  cat /etc/sysconfig/kernel | grep UPDATEDEFAULT=yes
RESULT: UPDATEDEFAULT=yes 
EXPECTED RESULT: 
RETURN CODE: 0
PASS
######################################################################################
# NEW TEST: ## Verify /etc/sysconfig/kernel contains DEFAULTKERNEL ... 
######################################################################################
COMMAND:  cat /etc/sysconfig/kernel | grep DEFAULTKERNEL=kernel
RESULT: DEFAULTKERNEL=kernel 
EXPECTED RESULT: 
RETURN CODE: 0
PASS
######################################################################################
# NEW TEST: ## Partition Format  ...
######################################################################################
mount | grep /dev/xvde1 | awk '{ print  }'
COMMAND:  echo ext4
RESULT: ext4 
EXPECTED RESULT: ext4
RETURN CODE: 0
PASS
######################################################################################
# NEW TEST: ## Partition Size ...
######################################################################################
size=5904752
COMMAND:  echo true
RESULT: true 
EXPECTED RESULT: true
RETURN CODE: 0
PASS
######################################################################################
# NEW TEST: ## Verify turning on/off swap file ... 
######################################################################################
COMMAND:  /sbin/swapoff /dev/xvde3 && /sbin/swapon /dev/xvde3
swapoff: /dev/xvde3: swapoff failed: Invalid argument
RESULT:  
EXPECTED RESULT: 
RETURN CODE: 255
FAIL2

######################################################################################
# NEW TEST: ## Verify swap size ... 
######################################################################################
free | grep Swap | awk '{print }'
COMMAND:  echo false
RESULT: false 
EXPECTED RESULT: 1
RETURN CODE: 0
FAIL2
false
######################################################################################
# NEW TEST: ## /sbin/getenforce ... 
######################################################################################
COMMAND:  /usr/sbin/getenforce
RESULT: Enforcing 
EXPECTED RESULT: Enforcing
RETURN CODE: 0
PASS
######################################################################################
# NEW TEST: ## Verify SELINUX enforcing ... 
######################################################################################
COMMAND:  grep ^SELINUX= /etc/sysconfig/selinux | cut -d\= -f2
RESULT: enforcing 
EXPECTED RESULT: enforcing
RETURN CODE: 0
PASS
######################################################################################
# NEW TEST: ## Verify SELINUXTYPE targeted ... 
######################################################################################
COMMAND:  grep ^SELINUXTYPE= /etc/sysconfig/selinux | cut -d\= -f2
RESULT: targeted 
EXPECTED RESULT: targeted
RETURN CODE: 0
PASS
######################################################################################
# NEW TEST: ## Flip Selinux Permissive ... 
######################################################################################
COMMAND:  /usr/sbin/setenforce Permissive && /usr/sbin/getenforce
RESULT: Permissive 
EXPECTED RESULT: Permissive
RETURN CODE: 0
PASS
######################################################################################
# NEW TEST: ## Flip Selinux Enforcing ... 
######################################################################################
COMMAND:  /usr/sbin/setenforce Enforcing && /usr/sbin/getenforce
RESULT: Enforcing 
EXPECTED RESULT: Enforcing
RETURN CODE: 0
PASS
######################################################################################
# NEW TEST: ## Verify no missing packages ... 
######################################################################################
COMMAND: /bin/rpm -qa --queryformat='%{NAME}\n' > /tmp/rpmqa.tmp
RETURN CODE: 0
COMMAND: comm -23 packages_61 /tmp/rpmqa
RETURN CODE: 0
COUNT = 0
COMMAND:  echo test passed
RESULT: test passed 
EXPECTED RESULT: 0
RETURN CODE: 0
PASS
######################################################################################
# NEW TEST: ## Verify RPMs ... 
######################################################################################
....L....  c /etc/pam.d/fingerprint-auth
....L....  c /etc/pam.d/password-auth
....L....  c /etc/pam.d/smartcard-auth
....L....  c /etc/pam.d/system-auth
.M.......    /var/cache/yum
    S file Size differs
    M Mode differs (includes permissions and file type)
    5 MD5 sum differs
    D Device major/minor number mismatch
    L readLink(2) path mismatch
    U User ownership differs
    G Group ownership differs
    T mTime differs

COMMAND:  cat /tmp/rpmqaV.txt | wc -l
RESULT: 5 
EXPECTED RESULT: 4
RETURN CODE: 0
FAIL2
5
######################################################################################
# NEW TEST: ## Verify Version 2 ... 
######################################################################################
COMMAND:  /bin/rpm -q --queryformat '%{RELEASE}\n' redhat-release-server | cut -d. -f1,2
RESULT: 6.1 
EXPECTED RESULT: 6.1
RETURN CODE: 0
PASS
######################################################################################
# NEW TEST: ## Verify packager ... 
######################################################################################
COMMAND:  cat /tmp/Packager | grep -v 'Red Hat, Inc.' |  grep -v crash-trace-commandPackager| wc -l
RESULT: 0 
EXPECTED RESULT: 0
RETURN CODE: 0
PASS
crash-trace-commandPackager    : Lai Jiangshan <laijs@cn.fujitsu.com>
######################################################################################
# NEW TEST: ## Verify GPG checking ... 
######################################################################################
COMMAND:  grep '^gpgcheck=1' /etc/yum.repos.d/redhat-*.repo | cut -d\= -f2 | sort -f | uniq
RESULT: 1 
EXPECTED RESULT: 1
RETURN CODE: 0
PASS
######################################################################################
# NEW TEST: ## Verify GPG Keys ... 
######################################################################################
COMMAND:  rpm -qa gpg-pubkey* | wc -l 
RESULT: 2 
EXPECTED RESULT: 2
RETURN CODE: 0
PASS
COMMAND:  rpm -qa gpg-pubkey* | sort -f | tail -n 1
RESULT: gpg-pubkey-fd431d51-4ae0493b 
EXPECTED RESULT: gpg-pubkey-fd431d51-4ae0493b
RETURN CODE: 0
PASS
COMMAND:  rpm -qa gpg-pubkey* | sort -f | head -n 1
RESULT: gpg-pubkey-2fa658e0-45700c69 
EXPECTED RESULT: gpg-pubkey-2fa658e0-45700c69
RETURN CODE: 0
PASS
######################################################################################
# NEW TEST: ## Verify disabled yum plugin ... 
######################################################################################
COMMAND:  grep ^enabled /etc/yum/pluginconf.d/rhnplugin.conf | grep -v '^#' | cut -d\= -f2 | awk '{print }' | sort -f | uniq
RESULT:  0 
EXPECTED RESULT: 
RETURN CODE: 0
PASS
######################################################################################
# NEW TEST: ## List the configured repositories...
######################################################################################
COMMAND:  /usr/bin/yum repolist
RESULT: Loaded plugins: amazon-id, rhui-lb, security
repo id                                    repo name                      status
rhui-us-west-client-config-server-6        Red Hat Update Infrastructure      0
rhui-us-west-rhel-server-releases          Red Hat Enterprise Linux Serve 4,105
rhui-us-west-rhel-server-releases-optional Red Hat Enterprise Linux Serve 2,623
repolist: 6,728 
EXPECTED RESULT: 
RETURN CODE: 0
PASS
######################################################################################
# NEW TEST: ## Search zsh...
######################################################################################
COMMAND:  /usr/bin/yum search zsh
RESULT: Loaded plugins: amazon-id, rhui-lb, security
=============================== N/S Matched: zsh ===============================
python-twisted-core-zsh.i686 : Tab completion for Zsh and Twisted Core
zsh-html.i686 : Zsh shell manual in html format
zsh.i686 : A powerful interactive shell

  Name and summary matches only, use "search all" for everything. 
EXPECTED RESULT: 
RETURN CODE: 0
PASS
######################################################################################
# NEW TEST: ## install zsh ... 
######################################################################################
COMMAND: /usr/bin/yum -y install zsh
RETURN CODE: 0
COMMAND:  /bin/rpm -q --queryformat '%{NAME}\n' zsh
RESULT: zsh 
EXPECTED RESULT: zsh
RETURN CODE: 0
PASS
######################################################################################
# NEW TEST: ## List available groups..
######################################################################################
COMMAND:  /usr/bin/yum grouplist
RESULT: Loaded plugins: amazon-id, rhui-lb, security
Setting up Group Process
Installed Groups:
   Additional Development
   Base
   Compatibility libraries
   Console internet tools
   Desktop Platform
   Directory Client
   E-mail server
   Fonts
   Graphical Administration Tools
   Hardware monitoring utilities
   Java Platform
   Large Systems Performance
   Legacy UNIX compatibility
   Legacy X Window System compatibility
   Network file system client
   Networking Tools
   Performance Tools
   Perl Support
   PostgreSQL Database client
   PostgreSQL Database server
   SNMP Support
   Scientific support
   Server Platform
   Smart card support
   System administration tools
   Web Server
Installed Language Groups:
   Arabic Support [ar]
   Armenian Support [hy]
   French Support [fr]
   Georgian Support [ka]
   Hebrew Support [he]
   Inuktitut Support [iu]
   Italian Support [it]
   Japanese Support [ja]
   Korean Support [ko]
   Lao Support [lo]
   Polish Support [pl]
   Russian Support [ru]
   Spanish Support [es]
   Tajik Support [tg]
Available Groups:
   Backup Client
   Backup Server
   CIFS file server
   Client management tools
   Debugging Tools
   Desktop
   Desktop Debugging and Performance Tools
   Desktop Platform Development
   Development tools
   Dial-up Networking Support
   Directory Server
   Eclipse
   Emacs
   Enterprise Identity Server Base
   FCoE Storage Client
   FTP server
   General Purpose Desktop
   Graphics Creation Tools
   Infiniband Support
   Input Methods
   Internet Applications
   Internet Browser
   KDE Desktop
   Mainframe Access
   Messaging Client Support
   MySQL Database client
   MySQL Database server
   NFS file server
   Network Infrastructure Server
   Network Storage Server
   Office Suite and Productivity
   PHP Support
   Print Server
   Printing client
   Remote Desktop Clients
   Security Tools
   Server Platform Development
   Somali Support
   Storage Availability Tools
   System Management
   Systems Management Messaging Server support
   TeX support
   Technical Writing
   TurboGears application framework
   Virtualization
   Virtualization Client
   Virtualization Platform
   Virtualization Tools
   Web Servlet Engine
   Web-Based Enterprise Management
   X Window System
   iSCSI Storage Client
Available Language Groups:
   Afrikaans Support [af]
   Albanian Support [sq]
   Amazigh Support [ber]
   Assamese Support [as]
   Azerbaijani Support [az]
   Basque Support [eu]
   Belarusian Support [be]
   Bengali Support [bn]
   Bhutanese Support [dz]
   Brazilian Portuguese Support [pt_BR]
   Breton Support [br]
   Bulgarian Support [bg]
   Catalan Support [ca]
   Chhattisgarhi Support [hne]
   Chichewa Support [ny]
   Chinese Support [zh]
   Coptic Support [cop]
   Croatian Support [hr]
   Czech Support [cs]
   Danish Support [da]
   Dutch Support [nl]
   English (UK) Support [en_GB]
   Esperanto Support [eo]
   Estonian Support [et]
   Ethiopic Support [am]
   Faroese Support [fo]
   Fijian Support [fj]
   Filipino Support [fil]
   Finnish Support [fi]
   Frisian Support [fy]
   Friulian Support [fur]
   Gaelic Support [gd]
   Galician Support [gl]
   German Support [de]
   Greek Support [el]
   Gujarati Support [gu]
   Hiligaynon Support [hil]
   Hindi Support [hi]
   Hungarian Support [hu]
   Icelandic Support [is]
   Indonesian Support [id]
   Interlingua Support [ia]
   Irish Support [ga]
   Kannada Support [kn]
   Kashmiri Support [ks]
   Kashubian Support [csb]
   Kazakh Support [kk]
   Khmer Support [km]
   Kinyarwanda Support [rw]
   Konkani Support [kok]
   Kurdish Support [ku]
   Latin Support [la]
   Latvian Support [lv]
   Lithuanian Support [lt]
   Low Saxon Support [nds]
   Luxembourgish Support [lb]
   Macedonian Support [mk]
   Maithili Support [mai]
   Malagasy Support [mg]
   Malay Support [ms]
   Malayalam Support [ml]
   Maltese Support [mt]
   Manx Support [gv]
   Maori Support [mi]
   Marathi Support [mr]
   Mongolian Support [mn]
   Myanmar (Burmese) Support [my]
   Nepali Support [ne]
   Northern Sotho Support [nso]
   Norwegian Support [nb]
   Occitan Support [oc]
   Oriya Support [or]
   Persian Support [fa]
   Portuguese Support [pt]
   Punjabi Support [pa]
   Romanian Support [ro]
   Sanskrit Support [sa]
   Sardinian Support [sc]
   Serbian Support [sr]
   Sindhi Support [sd]
   Sinhala Support [si]
   Slovak Support [sk]
   Slovenian Support [sl]
   Southern Ndebele Support [nr]
   Southern Sotho Support [st]
   Swahili Support [sw]
   Swati Support [ss]
   Swedish Support [sv]
   Tagalog Support [tl]
   Tamil Support [ta]
   Telugu Support [te]
   Tetum Support [tet]
   Thai Support [th]
   Tibetan Support [bo]
   Tsonga Support [ts]
   Tswana Support [tn]
   Turkish Support [tr]
   Turkmen Support [tk]
   Ukrainian Support [uk]
   Upper Sorbian Support [hsb]
   Urdu Support [ur]
   Uzbek Support [uz]
   Venda Support [ve]
   Vietnamese Support [vi]
   Walloon Support [wa]
   Welsh Support [cy]
   Xhosa Support [xh]
   Zulu Support [zu]
Done 
EXPECTED RESULT: 
RETURN CODE: 0
PASS
######################################################################################
# NEW TEST: ## Install Development tools group...
######################################################################################
COMMAND:  /usr/bin/yum -y groupinstall 'Development tools'

Comment 2 Kedar Bidarkar 2011-09-19 14:55:27 UTC
RESULT: Loaded plugins: amazon-id, rhui-lb, security
Setting up Group Process
Package gcc-4.4.5-6.el6.i686 already installed and latest version
Package 1:make-3.81-19.el6.i686 already installed and latest version
Package patch-2.6-6.el6.i686 already installed and latest version
Package 1:pkgconfig-0.23-9.1.el6.i686 already installed and latest version
Package gettext-0.17-16.el6.i686 already installed and latest version
Package binutils-2.20.51.0.2-5.20.el6_1.1.i686 already installed and latest version
Package elfutils-0.152-1.el6.i686 already installed and latest version
Package cvs-1.11.23-11.el6_0.1.i686 already installed and latest version
Package subversion-1.6.11-2.el6_1.4.i686 already installed and latest version
Resolving Dependencies
--> Running transaction check
---> Package autoconf.noarch 0:2.63-5.1.el6 will be installed
---> Package automake.noarch 0:1.11.1-1.2.el6 will be installed
---> Package bison.i686 0:2.4.1-5.el6 will be installed
---> Package byacc.i686 0:1.9.20070509-6.1.el6 will be installed
---> Package cscope.i686 0:15.6-6.el6 will be installed
---> Package ctags.i686 0:5.8-2.el6 will be installed
---> Package diffstat.i686 0:1.51-2.el6 will be installed
---> Package doxygen.i686 1:1.6.1-4.el6 will be installed
---> Package flex.i686 0:2.5.35-8.el6 will be installed
---> Package gcc-c++.i686 0:4.4.5-6.el6 will be installed
--> Processing Dependency: libstdc++-devel = 4.4.5-6.el6 for package: gcc-c++-4.4.5-6.el6.i686
---> Package gcc-gfortran.i686 0:4.4.5-6.el6 will be installed
---> Package git.i686 0:1.7.1-2.el6_0.1 will be installed
--> Processing Dependency: perl-Git = 1.7.1-2.el6_0.1 for package: git-1.7.1-2.el6_0.1.i686
--> Processing Dependency: perl(Error) for package: git-1.7.1-2.el6_0.1.i686
--> Processing Dependency: perl(Git) for package: git-1.7.1-2.el6_0.1.i686
---> Package indent.i686 0:2.2.10-5.1.el6 will be installed
---> Package intltool.noarch 0:0.41.0-1.1.el6 will be installed
--> Processing Dependency: gettext-devel for package: intltool-0.41.0-1.1.el6.noarch
---> Package libtool.i686 0:2.2.6-15.5.el6 will be installed
---> Package patchutils.i686 0:0.3.1-3.1.el6 will be installed
---> Package rcs.i686 0:5.7-37.el6 will be installed
---> Package redhat-rpm-config.noarch 0:9.0.3-33.el6 will be installed
---> Package rpm-build.i686 0:4.8.0-16.el6 will be installed
---> Package swig.i686 0:1.3.40-5.el6 will be installed
---> Package systemtap.i686 0:1.4-6.el6_1.3 will be installed
--> Running transaction check
---> Package gettext-devel.i686 0:0.17-16.el6 will be installed
--> Processing Dependency: gettext-libs = 0.17-16.el6 for package: gettext-devel-0.17-16.el6.i686
--> Processing Dependency: libasprintf.so.0 for package: gettext-devel-0.17-16.el6.i686
--> Processing Dependency: libgettextpo.so.0 for package: gettext-devel-0.17-16.el6.i686
---> Package libstdc++-devel.i686 0:4.4.5-6.el6 will be installed
---> Package perl-Error.noarch 1:0.17015-4.el6 will be installed
---> Package perl-Git.noarch 0:1.7.1-2.el6_0.1 will be installed
--> Running transaction check
---> Package gettext-libs.i686 0:0.17-16.el6 will be installed
--> Finished Dependency Resolution

Dependencies Resolved

================================================================================
 Package         Arch   Version         Repository                         Size
================================================================================
Installing:
 autoconf        noarch 2.63-5.1.el6    rhui-us-west-rhel-server-releases 781 k
 automake        noarch 1.11.1-1.2.el6  rhui-us-west-rhel-server-releases 550 k
 bison           i686   2.4.1-5.el6     rhui-us-west-rhel-server-releases 626 k
 byacc           i686   1.9.20070509-6.1.el6
                                        rhui-us-west-rhel-server-releases  44 k
 cscope          i686   15.6-6.el6      rhui-us-west-rhel-server-releases 130 k
 ctags           i686   5.8-2.el6       rhui-us-west-rhel-server-releases 142 k
 diffstat        i686   1.51-2.el6      rhui-us-west-rhel-server-releases  29 k
 doxygen         i686   1:1.6.1-4.el6   rhui-us-west-rhel-server-releases 2.3 M
 flex            i686   2.5.35-8.el6    rhui-us-west-rhel-server-releases 279 k
 gcc-c++         i686   4.4.5-6.el6     rhui-us-west-rhel-server-releases 4.3 M
 gcc-gfortran    i686   4.4.5-6.el6     rhui-us-west-rhel-server-releases 4.1 M
 git             i686   1.7.1-2.el6_0.1 rhui-us-west-rhel-server-releases 4.5 M
 indent          i686   2.2.10-5.1.el6  rhui-us-west-rhel-server-releases 111 k
 intltool        noarch 0.41.0-1.1.el6  rhui-us-west-rhel-server-releases  58 k
 libtool         i686   2.2.6-15.5.el6  rhui-us-west-rhel-server-releases 564 k
 patchutils      i686   0.3.1-3.1.el6   rhui-us-west-rhel-server-releases  94 k
 rcs             i686   5.7-37.el6      rhui-us-west-rhel-server-releases 169 k
 redhat-rpm-config
                 noarch 9.0.3-33.el6    rhui-us-west-rhel-server-releases  57 k
 rpm-build       i686   4.8.0-16.el6    rhui-us-west-rhel-server-releases 124 k
 swig            i686   1.3.40-5.el6    rhui-us-west-rhel-server-releases 1.1 M
 systemtap       i686   1.4-6.el6_1.3   rhui-us-west-rhel-server-releases 2.8 M
Installing for dependencies:
 gettext-devel   i686   0.17-16.el6     rhui-us-west-rhel-server-releases 153 k
 gettext-libs    i686   0.17-16.el6     rhui-us-west-rhel-server-releases 110 k
 libstdc++-devel i686   4.4.5-6.el6     rhui-us-west-rhel-server-releases 1.5 M
 perl-Error      noarch 1:0.17015-4.el6 rhui-us-west-rhel-server-releases  29 k
 perl-Git        noarch 1.7.1-2.el6_0.1 rhui-us-west-rhel-server-releases  28 k

Transaction Summary
================================================================================
Install      26 Package(s)

Total download size: 25 M
Installed size: 25 M
Downloading Packages:
--------------------------------------------------------------------------------
Total                                           3.1 MB/s |  25 MB     00:07     
Running rpm_check_debug
Running Transaction Test
Transaction Test Succeeded
Running Transaction

  Installing : 1:perl-Error-0.17015-4.el6.noarch                           1/26 

  Installing : autoconf-2.63-5.1.el6.noarch                                2/26 

  Installing : automake-1.11.1-1.2.el6.noarch                              3/26 

  Installing : git-1.7.1-2.el6_0.1.i686                                    4/26 

  Installing : perl-Git-1.7.1-2.el6_0.1.noarch                             5/26 

  Installing : libstdc++-devel-4.4.5-6.el6.i686                            6/26 

  Installing : libtool-2.2.6-15.5.el6.i686                                 7/26 

  Installing : redhat-rpm-config-9.0.3-33.el6.noarch                       8/26 

  Installing : gettext-libs-0.17-16.el6.i686                               9/26 

  Installing : gettext-devel-0.17-16.el6.i686                             10/26 

  Installing : intltool-0.41.0-1.1.el6.noarch                             11/26 

  Installing : gcc-c++-4.4.5-6.el6.i686                                   12/26 

  Installing : rcs-5.7-37.el6.i686                                        13/26 

  Installing : cscope-15.6-6.el6.i686                                     14/26 

  Installing : indent-2.2.10-5.1.el6.i686                                 15/26 

  Installing : swig-1.3.40-5.el6.i686                                     16/26 

  Installing : patchutils-0.3.1-3.1.el6.i686                              17/26 

  Installing : bison-2.4.1-5.el6.i686                                     18/26 

  Installing : ctags-5.8-2.el6.i686                                       19/26 

  Installing : byacc-1.9.20070509-6.1.el6.i686                            20/26 

  Installing : rpm-build-4.8.0-16.el6.i686                                21/26 

  Installing : 1:doxygen-1.6.1-4.el6.i686                                 22/26 

  Installing : diffstat-1.51-2.el6.i686                                   23/26 

  Installing : gcc-gfortran-4.4.5-6.el6.i686                              24/26 

  Installing : flex-2.5.35-8.el6.i686                                     25/26 

  Installing : systemtap-1.4-6.el6_1.3.i686                               26/26 

Installed:
  autoconf.noarch 0:2.63-5.1.el6     automake.noarch 0:1.11.1-1.2.el6          
  bison.i686 0:2.4.1-5.el6           byacc.i686 0:1.9.20070509-6.1.el6         
  cscope.i686 0:15.6-6.el6           ctags.i686 0:5.8-2.el6                    
  diffstat.i686 0:1.51-2.el6         doxygen.i686 1:1.6.1-4.el6                
  flex.i686 0:2.5.35-8.el6           gcc-c++.i686 0:4.4.5-6.el6                
  gcc-gfortran.i686 0:4.4.5-6.el6    git.i686 0:1.7.1-2.el6_0.1                
  indent.i686 0:2.2.10-5.1.el6       intltool.noarch 0:0.41.0-1.1.el6          
  libtool.i686 0:2.2.6-15.5.el6      patchutils.i686 0:0.3.1-3.1.el6           
  rcs.i686 0:5.7-37.el6              redhat-rpm-config.noarch 0:9.0.3-33.el6   
  rpm-build.i686 0:4.8.0-16.el6      swig.i686 0:1.3.40-5.el6                  
  systemtap.i686 0:1.4-6.el6_1.3    

Dependency Installed:
  gettext-devel.i686 0:0.17-16.el6        gettext-libs.i686 0:0.17-16.el6       
  libstdc++-devel.i686 0:4.4.5-6.el6      perl-Error.noarch 1:0.17015-4.el6     
  perl-Git.noarch 0:1.7.1-2.el6_0.1      

Complete! 
EXPECTED RESULT: 
RETURN CODE: 0
PASS
######################################################################################
# NEW TEST: ## Verify yum update ... 
######################################################################################
COMMAND:  /usr/bin/yum -y update
RESULT: Loaded plugins: amazon-id, rhui-lb, security
Setting up Update Process
No Packages marked for Update 
EXPECTED RESULT: 
RETURN CODE: 0
PASS
######################################################################################
# NEW TEST: ## Verify no fa1lures in rpm package ... 
######################################################################################
COMMAND:  cat /root/valid/src/validate.log | grep 'failure in rpm package' | wc -l
RESULT: 1 
EXPECTED RESULT: 1
RETURN CODE: 0
PASS
######################################################################################
# NEW TEST: ## Verify no rpm scriplet fa1lures ... 
######################################################################################
COMMAND:  cat /root/valid/src/validate.log | grep 'scriptlet failed, exit status 1' | wc -l
RESULT: 1 
EXPECTED RESULT: 1
RETURN CODE: 0
PASS
######################################################################################
# NEW TEST: ## Verify package removal... 
######################################################################################
COMMAND: /bin/rpm -e zsh
RETURN CODE: 0
COMMAND:  /bin/rpm -q zsh
RESULT: package zsh is not installed 
EXPECTED RESULT: package zsh is not installed
RETURN CODE: 1
PASS
######################################################################################
# NEW TEST: ## Verify bash_history ... 
######################################################################################
COMMAND:  cat ~/.bash_history | wc -l 
cat: /root/.bash_history: No such file or directory
RESULT: 0 
EXPECTED RESULT: 0
RETURN CODE: 0
PASS
######################################################################################
# NEW TEST: ## Verify no systemid file ... 
######################################################################################
COMMAND:  echo true
RESULT: true 
EXPECTED RESULT: 
RETURN CODE: 0
PASS
######################################################################################
# NEW TEST: ## Verify rh-cloud-firstboot is OFF ... 
######################################################################################
COMMAND:  chkconfig --list | grep rh-cloud | grep 3:off | wc -l
RESULT: 1 
EXPECTED RESULT: 1
RETURN CODE: 0
PASS
/etc/sysconfig/rh-cloud-firstboot FOUND
COMMAND:  echo true
RESULT: true 
EXPECTED RESULT: 
RETURN CODE: 0
PASS
COMMAND:  cat /etc/sysconfig/rh-cloud-firstboot
RESULT: RUN_FIRSTBOOT=NO 
EXPECTED RESULT: RUN_FIRSTBOOT=NO
RETURN CODE: 0
PASS
######################################################################################
# NEW TEST: ## Verify nameserver ... 
######################################################################################
COMMAND:  /usr/bin/dig clock.redhat.com 2>> /root/valid/src/validate.log | grep 66.187.233.4  | wc -l
RESULT: 1 
EXPECTED RESULT: 
RETURN CODE: 0
PASS
######################################################################################
# NEW TEST: ## Verify group file ... 
######################################################################################
COMMAND:  cat /etc/group | grep root:x:0
RESULT: root:x:0:root 
EXPECTED RESULT: root:x:0:root
RETURN CODE: 0
PASS
COMMAND:  cat /etc/group | grep bin:x:1
RESULT: bin:x:1:root,bin,daemon 
EXPECTED RESULT: bin:x:1:root,bin,daemon
RETURN CODE: 0
PASS
COMMAND:  cat /etc/group | grep daemon:x:2
RESULT: daemon:x:2:root,bin,daemon 
EXPECTED RESULT: daemon:x:2:root,bin,daemon
RETURN CODE: 0
PASS
COMMAND:  cat /etc/group | grep nobody:x:99
RESULT: nobody:x:99: 
EXPECTED RESULT: nobody:x:99:
RETURN CODE: 0
PASS
######################################################################################
# NEW TEST: ## Verify new passwd file ... 
######################################################################################
COMMAND:  cat /etc/passwd | grep root:x:0
RESULT: root:x:0:0:root:/root:/bin/bash 
EXPECTED RESULT: root:x:0:0:root:/root:/bin/bash
RETURN CODE: 0
PASS
COMMAND:  cat /etc/passwd | grep nobody:x:99
RESULT: nobody:x:99:99:Nobody:/:/sbin/nologin 
EXPECTED RESULT: nobody:x:99:99:Nobody:/:/sbin/nologin
RETURN CODE: 0
PASS
COMMAND:  cat /etc/passwd | grep sshd
RESULT: sshd:x:74:74:Privilege-separated SSH:/var/empty/sshd:/sbin/nologin 
EXPECTED RESULT: sshd:x:74:74:Privilege-separated SSH:/var/empty/sshd:/sbin/nologin
RETURN CODE: 0
PASS
######################################################################################
# NEW TEST: ## Verify runlevel ... 
######################################################################################
COMMAND:  cat /etc/inittab | grep id:
RESULT: id:3:initdefault: 
EXPECTED RESULT: id:3:initdefault:
RETURN CODE: 0
PASS
######################################################################################
# NEW TEST: ## Verify new shells file ... 
######################################################################################
COMMAND:  cat /etc/shells | grep bash
RESULT: /bin/bash 
EXPECTED RESULT: /bin/bash
RETURN CODE: 0
PASS
COMMAND:  cat /etc/shells | grep nologin
RESULT: /sbin/nologin 
EXPECTED RESULT: /sbin/nologin
RETURN CODE: 0
PASS
######################################################################################
# NEW TEST: ## Verify networking ... 
######################################################################################
COMMAND:  grep ^NETWORKING= /etc/sysconfig/network | cut -d\= -f2
RESULT: yes 
EXPECTED RESULT: yes
RETURN CODE: 0
PASS
######################################################################################
# NEW TEST: ## Verify device ... 
######################################################################################
COMMAND:  grep ^DEVICE= /etc/sysconfig/network-scripts/ifcfg-eth0 | cut -d\= -f2
RESULT: eth0 
EXPECTED RESULT: eth0
RETURN CODE: 0
PASS
######################################################################################
# NEW TEST: ## Verify iptables ... 
######################################################################################
COMMAND: /etc/init.d/iptables status | grep REJECT 
5    REJECT     all  --  0.0.0.0/0            0.0.0.0/0           reject-with icmp-host-prohibited 
1    REJECT     all  --  0.0.0.0/0            0.0.0.0/0           reject-with icmp-host-prohibited 
RETURN CODE: 0
COMMAND:  /etc/init.d/iptables status | grep :22 | grep ACCEPT | wc -l 
RESULT: 1 
EXPECTED RESULT: 1
RETURN CODE: 0
PASS
######################################################################################
# NEW TEST: ## Verify sshd ...
######################################################################################
COMMAND:  chkconfig --list | grep sshd
RESULT: sshd           	0:off	1:off	2:on	3:on	4:on	5:on	6:off 
EXPECTED RESULT: sshd           	0:off	1:off	2:on	3:on	4:on	5:on	6:off
RETURN CODE: 0
PASS
COMMAND:  /etc/init.d/sshd status | grep running | wc -l
RESULT: 1 
EXPECTED RESULT: 1
RETURN CODE: 0
PASS
######################################################################################
# NEW TEST: ## Verify  chkconfig ... 
######################################################################################
COMMAND:  chkconfig --list | grep crond | cut -f 5
RESULT: 3:on 
EXPECTED RESULT: 3:on
RETURN CODE: 0
PASS
COMMAND:  chkconfig --list | grep  iptables | cut -f 5
RESULT: 3:on 
EXPECTED RESULT: 3:on
RETURN CODE: 0
PASS
######################################################################################
# NEW TEST: ## Verify rsyslog is on ... 
######################################################################################
COMMAND:  chkconfig --list | grep rsyslog | cut -f 5
RESULT: 3:on 
EXPECTED RESULT: 3:on
RETURN CODE: 0
PASS
######################################################################################
# NEW TEST: ## Verify rsyslog config ... 
######################################################################################
COMMAND:  md5sum /etc/rsyslog.conf | cut -f 1 -d  " "
RESULT: dd356958ca9c4e779f7fac13dde3c1b5 
EXPECTED RESULT: dd356958ca9c4e779f7fac13dde3c1b5
RETURN CODE: 0
PASS
######################################################################################
# NEW TEST: ## Verify auditd is on ... 
######################################################################################
COMMAND:  /sbin/chkconfig --list auditd | grep 3:on
RESULT: auditd         	0:off	1:off	2:on	3:on	4:on	5:on	6:off 
EXPECTED RESULT: 
RETURN CODE: 0
PASS
COMMAND:  /sbin/chkconfig --list auditd | grep 5:on
RESULT: auditd         	0:off	1:off	2:on	3:on	4:on	5:on	6:off 
EXPECTED RESULT: 
RETURN CODE: 0
PASS
######################################################################################
# NEW TEST: ## Verify audit.rules ... 
######################################################################################
COMMAND:  md5sum /etc/audit/audit.rules | cut -f 1 -d  " "
RESULT: f9869e1191838c461f5b9051c78a638d 
EXPECTED RESULT: f9869e1191838c461f5b9051c78a638d
RETURN CODE: 0
PASS
######################################################################################
# NEW TEST: ## Verify auditd.conf ... 
######################################################################################
COMMAND:  md5sum /etc/audit/auditd.conf | cut -f 1 -d  " "
RESULT: 612ddf28c3916530d47ef56a1b1ed1ed 
EXPECTED RESULT: 612ddf28c3916530d47ef56a1b1ed1ed
RETURN CODE: 0
PASS
######################################################################################
# NEW TEST: ## Verify auditd sysconfig ... 
######################################################################################
COMMAND:  md5sum /etc/sysconfig/auditd | cut -f 1 -d  " "
RESULT: 123beb3a97a32d96eba4f11509e39da2 
EXPECTED RESULT: 123beb3a97a32d96eba4f11509e39da2
RETURN CODE: 0
PASS
######################################################################################
# NEW TEST: ## Verify sshd_config settings ...
######################################################################################
COMMAND:  cat /etc/ssh/sshd_config  | grep  PasswordAuthentication | grep no | wc -l
RESULT: 1 
EXPECTED RESULT: 1
RETURN CODE: 0
PASS
######################################################################################
# NEW TEST: ## Verify /etc/ld.so.conf.d/libc6-xen.conf is not present ... 
######################################################################################
COMMAND:  ls /etc/ld.so.conf.d/libc6-xen.conf
ls: cannot access /etc/ld.so.conf.d/libc6-xen.conf: No such file or directory
RESULT:  
EXPECTED RESULT: 2
RETURN CODE: 2
PASS
######################################################################################
# NEW TEST: ##test menu.lst ... 
######################################################################################
COMMAND:  file /boot/grub/menu.lst  | grep symbolic | wc -l
RESULT: 1 
EXPECTED RESULT: 1
RETURN CODE: 0
PASS
COMMAND:  file /boot/grub/menu.lst  | grep grub.conf | wc -l
RESULT: 1 
EXPECTED RESULT: 1
RETURN CODE: 0
PASS
COMMAND:  cat /boot/grub/grub.conf  | grep "(hd0,0)" | wc -l
RESULT: 0 
EXPECTED RESULT: 0
RETURN CODE: 0
PASS
######################################################################################
# NEW TEST: ## Verify resize2fs ... 
######################################################################################
COMMAND: resize2fs -p /dev/xvde1 15000M
resize2fs 1.41.12 (17-May-2010)
RETURN CODE: 0
COMMAND:  df -h | grep 15G | wc -l 
RESULT: 1 
EXPECTED RESULT: 1
RETURN CODE: 0
PASS
######################################################################################
# NEW TEST: Fetching Host Details 
######################################################################################
This Host => ec2-204-236-152-39.us-west-1.compute.amazonaws.com with Image Id : ami-03f3ae46, is launched with Instance Id : i-6d924a2a , Instance Type : c1.medium and Arch : i386 in the Region : us-west-1b
This is a Hourly image
The Validate Signature is : aoNS/97b7EM4KzwdZuyJUZpBBJcSfKNZMEetwKkPKljHEqJjeYWrU73MWZj0Yf/LCuC7lfmKxAt8
B9zw1MaZ62tV+6GrFM4ZmwXIXPTyIpUUVd8QdVnLrBCAthYofYZKlzcCNq7w4qOUY1ScZYD8g7SJ
U+J5SekhmmT05lhP3JM=

## Summary ##
FAILURES = 3
FAILED TESTS = ## Verify turning on/off swap file ... ## Verify swap size ... ## Verify RPMs ...
LOG FILE = /root/valid/src/validate.log
## Summary ##

######################################################################################
# NEW TEST: ## Open a bugzilla
######################################################################################

Comment 3 Kedar Bidarkar 2011-09-19 14:58:48 UTC
IMAGE ID= ami-03f3ae46_us-west-1_t1.micro
######################################################################################
# NEW TEST: ## Open a bugzilla
######################################################################################
######################################################################################
# NEW TEST: Fetching Host Details 
######################################################################################
This Host => ec2-50-18-74-131.us-west-1.compute.amazonaws.com with Image Id : ami-03f3ae46, is launched with Instance Id : i-73924a34 , Instance Type : t1.micro and Arch : i386 in the Region : us-west-1c
This is a Hourly image
The Validate Signature is : P7fb5zOAbXcgaPO8DmJQOflHW8wgBQow/7DeBpQbSXwfjrpZVoxG9hZ9eJKjYYTV733HodhknSKj
WbRe1JeUfAfSq6ydzgMeyQ/3DoTHidXrQP6blmTTqYY5g4knsvzy6bJO96VXwWPVG64fhi0FMmrl
lBc1Ih9BfYY2Wa7Cdcc=
/root/valid/src
ip-10-171-29-4
Red Hat Enterprise Linux Server release 6.1 (Santiago)
######################################################################################
# NEW TEST: The selected image has the version RHEL 6.1
######################################################################################
######################################################################################
# NEW TEST: ## Verify kernel name ... 
######################################################################################
COMMAND:  /bin/uname -s
RESULT: Linux 
EXPECTED RESULT: Linux
RETURN CODE: 0
PASS
######################################################################################
# NEW TEST: ## Verify latest installed kernel is running ... 
######################################################################################
RHEL VERSION IS 6
LATEST_RPM_KERNEL_VERSION=rpm -q kernel --last | head -n 1 |  cut -c 8-60 | cut -d ' ' -f 1
CURRENT_UNAME_KERNAL_VERSION=2.6.32-131.12.1.el6
assert latest rpm kernel = uname -r
COMMAND:  uname -r | sed  's/\(.*\)...../\1/'
RESULT: 2.6.32-131.12.1.el6 
EXPECTED RESULT: 2.6.32-131.12.1.el6
RETURN CODE: 0
PASS
######################################################################################
# NEW TEST: ## Verify latest kenerl is in /boot/grub/menu.1st ... 
######################################################################################
COMMAND:  cat /boot/grub/menu.lst | grep 2.6.32-131.12.1.el6
RESULT: title RHEL-6.1-Starter-EBS-i386-6 (2.6.32-131.12.1.el6.i686)
        kernel /boot/vmlinuz-2.6.32-131.12.1.el6.i686 ro root=LABEL=_/ 
        initrd /boot/initramfs-2.6.32-131.12.1.el6.i686.img 
EXPECTED RESULT: 
RETURN CODE: 0
PASS
######################################################################################
# NEW TEST: ## Verify operating system ... 
######################################################################################
COMMAND:  /bin/uname -o
RESULT: GNU/Linux 
EXPECTED RESULT: GNU/Linux
RETURN CODE: 0
PASS
######################################################################################
# NEW TEST: ## Verify /etc/sysconfig/kernel ... 
######################################################################################
COMMAND:  ls /etc/sysconfig/kernel
RESULT: /etc/sysconfig/kernel 
EXPECTED RESULT: 
RETURN CODE: 0
PASS
######################################################################################
# NEW TEST: ## Verify /etc/sysconfig/kernel contains UPDATEDEFAULT ... 
######################################################################################
COMMAND:  cat /etc/sysconfig/kernel | grep UPDATEDEFAULT=yes
RESULT: UPDATEDEFAULT=yes 
EXPECTED RESULT: 
RETURN CODE: 0
PASS
######################################################################################
# NEW TEST: ## Verify /etc/sysconfig/kernel contains DEFAULTKERNEL ... 
######################################################################################
COMMAND:  cat /etc/sysconfig/kernel | grep DEFAULTKERNEL=kernel
RESULT: DEFAULTKERNEL=kernel 
EXPECTED RESULT: 
RETURN CODE: 0
PASS
######################################################################################
# NEW TEST: ## Partition Format  ...
######################################################################################
mount | grep /dev/xvde1 | awk '{ print  }'
COMMAND:  echo ext4
RESULT: ext4 
EXPECTED RESULT: ext4
RETURN CODE: 0
PASS
######################################################################################
# NEW TEST: ## Partition Size ...
######################################################################################
size=5904752
COMMAND:  echo true
RESULT: true 
EXPECTED RESULT: true
RETURN CODE: 0
PASS
######################################################################################
# NEW TEST: ## /sbin/getenforce ... 
######################################################################################
COMMAND:  /usr/sbin/getenforce
RESULT: Enforcing 
EXPECTED RESULT: Enforcing
RETURN CODE: 0
PASS
######################################################################################
# NEW TEST: ## Verify SELINUX enforcing ... 
######################################################################################
COMMAND:  grep ^SELINUX= /etc/sysconfig/selinux | cut -d\= -f2
RESULT: enforcing 
EXPECTED RESULT: enforcing
RETURN CODE: 0
PASS
######################################################################################
# NEW TEST: ## Verify SELINUXTYPE targeted ... 
######################################################################################
COMMAND:  grep ^SELINUXTYPE= /etc/sysconfig/selinux | cut -d\= -f2
RESULT: targeted 
EXPECTED RESULT: targeted
RETURN CODE: 0
PASS
######################################################################################
# NEW TEST: ## Flip Selinux Permissive ... 
######################################################################################
COMMAND:  /usr/sbin/setenforce Permissive && /usr/sbin/getenforce
RESULT: Permissive 
EXPECTED RESULT: Permissive
RETURN CODE: 0
PASS
######################################################################################
# NEW TEST: ## Flip Selinux Enforcing ... 
######################################################################################
COMMAND:  /usr/sbin/setenforce Enforcing && /usr/sbin/getenforce
RESULT: Enforcing 
EXPECTED RESULT: Enforcing
RETURN CODE: 0
PASS
######################################################################################
# NEW TEST: ## Verify no missing packages ... 
######################################################################################
COMMAND: /bin/rpm -qa --queryformat='%{NAME}\n' > /tmp/rpmqa.tmp
RETURN CODE: 0
COMMAND: comm -23 packages_61 /tmp/rpmqa
RETURN CODE: 0
COUNT = 0
COMMAND:  echo test passed
RESULT: test passed 
EXPECTED RESULT: 0
RETURN CODE: 0
PASS
######################################################################################
# NEW TEST: ## Verify RPMs ... 
######################################################################################
....L....  c /etc/pam.d/fingerprint-auth
....L....  c /etc/pam.d/password-auth
....L....  c /etc/pam.d/smartcard-auth
....L....  c /etc/pam.d/system-auth
.M.......    /var/cache/yum
    S file Size differs
    M Mode differs (includes permissions and file type)
    5 MD5 sum differs
    D Device major/minor number mismatch
    L readLink(2) path mismatch
    U User ownership differs
    G Group ownership differs
    T mTime differs

COMMAND:  cat /tmp/rpmqaV.txt | wc -l
RESULT: 5 
EXPECTED RESULT: 4
RETURN CODE: 0
FAIL2
5
######################################################################################
# NEW TEST: ## Verify Version 2 ... 
######################################################################################
COMMAND:  /bin/rpm -q --queryformat '%{RELEASE}\n' redhat-release-server | cut -d. -f1,2
RESULT: 6.1 
EXPECTED RESULT: 6.1
RETURN CODE: 0
PASS
######################################################################################
# NEW TEST: ## Verify packager ... 
######################################################################################
COMMAND:  cat /tmp/Packager | grep -v 'Red Hat, Inc.' |  grep -v crash-trace-commandPackager| wc -l
RESULT: 0 
EXPECTED RESULT: 0
RETURN CODE: 0
PASS
crash-trace-commandPackager    : Lai Jiangshan <laijs@cn.fujitsu.com>
######################################################################################
# NEW TEST: ## Verify GPG checking ... 
######################################################################################
COMMAND:  grep '^gpgcheck=1' /etc/yum.repos.d/redhat-*.repo | cut -d\= -f2 | sort -f | uniq
RESULT: 1 
EXPECTED RESULT: 1
RETURN CODE: 0
PASS
######################################################################################
# NEW TEST: ## Verify GPG Keys ... 
######################################################################################
COMMAND:  rpm -qa gpg-pubkey* | wc -l 
RESULT: 2 
EXPECTED RESULT: 2
RETURN CODE: 0
PASS
COMMAND:  rpm -qa gpg-pubkey* | sort -f | tail -n 1
RESULT: gpg-pubkey-fd431d51-4ae0493b 
EXPECTED RESULT: gpg-pubkey-fd431d51-4ae0493b
RETURN CODE: 0
PASS
COMMAND:  rpm -qa gpg-pubkey* | sort -f | head -n 1
RESULT: gpg-pubkey-2fa658e0-45700c69 
EXPECTED RESULT: gpg-pubkey-2fa658e0-45700c69
RETURN CODE: 0
PASS
######################################################################################
# NEW TEST: ## Verify disabled yum plugin ... 
######################################################################################
COMMAND:  grep ^enabled /etc/yum/pluginconf.d/rhnplugin.conf | grep -v '^#' | cut -d\= -f2 | awk '{print }' | sort -f | uniq
RESULT:  0 
EXPECTED RESULT: 
RETURN CODE: 0
PASS
######################################################################################
# NEW TEST: ## List the configured repositories...
######################################################################################
COMMAND:  /usr/bin/yum repolist
RESULT: Loaded plugins: amazon-id, rhui-lb, security
repo id                                    repo name                      status
rhui-us-west-client-config-server-6        Red Hat Update Infrastructure      0
rhui-us-west-rhel-server-releases          Red Hat Enterprise Linux Serve 4,105
rhui-us-west-rhel-server-releases-optional Red Hat Enterprise Linux Serve 2,623
repolist: 6,728 
EXPECTED RESULT: 
RETURN CODE: 0
PASS
######################################################################################
# NEW TEST: ## Search zsh...
######################################################################################
COMMAND:  /usr/bin/yum search zsh
RESULT: Loaded plugins: amazon-id, rhui-lb, security
=============================== N/S Matched: zsh ===============================
python-twisted-core-zsh.i686 : Tab completion for Zsh and Twisted Core
zsh-html.i686 : Zsh shell manual in html format
zsh.i686 : A powerful interactive shell

  Name and summary matches only, use "search all" for everything. 
EXPECTED RESULT: 
RETURN CODE: 0
PASS
######################################################################################
# NEW TEST: ## install zsh ... 
######################################################################################
COMMAND: /usr/bin/yum -y install zsh
RETURN CODE: 0
COMMAND:  /bin/rpm -q --queryformat '%{NAME}\n' zsh
RESULT: zsh 
EXPECTED RESULT: zsh
RETURN CODE: 0
PASS
######################################################################################
# NEW TEST: ## List available groups..
######################################################################################
COMMAND:  /usr/bin/yum grouplist
RESULT: Loaded plugins: amazon-id, rhui-lb, security
Setting up Group Process
Installed Groups:
   Additional Development
   Base
   Compatibility libraries
   Console internet tools
   Desktop Platform
   Directory Client
   E-mail server
   Fonts
   Graphical Administration Tools
   Hardware monitoring utilities
   Java Platform
   Large Systems Performance
   Legacy UNIX compatibility
   Legacy X Window System compatibility
   Network file system client
   Networking Tools
   Performance Tools
   Perl Support
   PostgreSQL Database client
   PostgreSQL Database server
   SNMP Support
   Scientific support
   Server Platform
   Smart card support
   System administration tools
   Web Server
Installed Language Groups:
   Arabic Support [ar]
   Armenian Support [hy]
   French Support [fr]
   Georgian Support [ka]
   Hebrew Support [he]
   Inuktitut Support [iu]
   Italian Support [it]
   Japanese Support [ja]
   Korean Support [ko]
   Lao Support [lo]
   Polish Support [pl]
   Russian Support [ru]
   Spanish Support [es]
   Tajik Support [tg]
Available Groups:
   Backup Client
   Backup Server
   CIFS file server
   Client management tools
   Debugging Tools
   Desktop
   Desktop Debugging and Performance Tools
   Desktop Platform Development
   Development tools
   Dial-up Networking Support
   Directory Server
   Eclipse
   Emacs
   Enterprise Identity Server Base
   FCoE Storage Client
   FTP server
   General Purpose Desktop
   Graphics Creation Tools
   Infiniband Support
   Input Methods
   Internet Applications
   Internet Browser
   KDE Desktop
   Mainframe Access
   Messaging Client Support
   MySQL Database client
   MySQL Database server
   NFS file server
   Network Infrastructure Server
   Network Storage Server
   Office Suite and Productivity
   PHP Support
   Print Server
   Printing client
   Remote Desktop Clients
   Security Tools
   Server Platform Development
   Somali Support
   Storage Availability Tools
   System Management
   Systems Management Messaging Server support
   TeX support
   Technical Writing
   TurboGears application framework
   Virtualization
   Virtualization Client
   Virtualization Platform
   Virtualization Tools
   Web Servlet Engine
   Web-Based Enterprise Management
   X Window System
   iSCSI Storage Client
Available Language Groups:
   Afrikaans Support [af]
   Albanian Support [sq]
   Amazigh Support [ber]
   Assamese Support [as]
   Azerbaijani Support [az]
   Basque Support [eu]
   Belarusian Support [be]
   Bengali Support [bn]
   Bhutanese Support [dz]
   Brazilian Portuguese Support [pt_BR]
   Breton Support [br]
   Bulgarian Support [bg]
   Catalan Support [ca]
   Chhattisgarhi Support [hne]
   Chichewa Support [ny]
   Chinese Support [zh]
   Coptic Support [cop]
   Croatian Support [hr]
   Czech Support [cs]
   Danish Support [da]
   Dutch Support [nl]
   English (UK) Support [en_GB]
   Esperanto Support [eo]
   Estonian Support [et]
   Ethiopic Support [am]
   Faroese Support [fo]
   Fijian Support [fj]
   Filipino Support [fil]
   Finnish Support [fi]
   Frisian Support [fy]
   Friulian Support [fur]
   Gaelic Support [gd]
   Galician Support [gl]
   German Support [de]
   Greek Support [el]
   Gujarati Support [gu]
   Hiligaynon Support [hil]
   Hindi Support [hi]
   Hungarian Support [hu]
   Icelandic Support [is]
   Indonesian Support [id]
   Interlingua Support [ia]
   Irish Support [ga]
   Kannada Support [kn]
   Kashmiri Support [ks]
   Kashubian Support [csb]
   Kazakh Support [kk]
   Khmer Support [km]
   Kinyarwanda Support [rw]
   Konkani Support [kok]
   Kurdish Support [ku]
   Latin Support [la]
   Latvian Support [lv]
   Lithuanian Support [lt]
   Low Saxon Support [nds]
   Luxembourgish Support [lb]
   Macedonian Support [mk]
   Maithili Support [mai]
   Malagasy Support [mg]
   Malay Support [ms]
   Malayalam Support [ml]
   Maltese Support [mt]
   Manx Support [gv]
   Maori Support [mi]
   Marathi Support [mr]
   Mongolian Support [mn]
   Myanmar (Burmese) Support [my]
   Nepali Support [ne]
   Northern Sotho Support [nso]
   Norwegian Support [nb]
   Occitan Support [oc]
   Oriya Support [or]
   Persian Support [fa]
   Portuguese Support [pt]
   Punjabi Support [pa]
   Romanian Support [ro]
   Sanskrit Support [sa]
   Sardinian Support [sc]
   Serbian Support [sr]
   Sindhi Support [sd]
   Sinhala Support [si]
   Slovak Support [sk]
   Slovenian Support [sl]
   Southern Ndebele Support [nr]
   Southern Sotho Support [st]
   Swahili Support [sw]
   Swati Support [ss]
   Swedish Support [sv]
   Tagalog Support [tl]
   Tamil Support [ta]
   Telugu Support [te]
   Tetum Support [tet]
   Thai Support [th]
   Tibetan Support [bo]
   Tsonga Support [ts]
   Tswana Support [tn]
   Turkish Support [tr]
   Turkmen Support [tk]
   Ukrainian Support [uk]
   Upper Sorbian Support [hsb]
   Urdu Support [ur]
   Uzbek Support [uz]
   Venda Support [ve]
   Vietnamese Support [vi]
   Walloon Support [wa]
   Welsh Support [cy]
   Xhosa Support [xh]
   Zulu Support [zu]
Done 
EXPECTED RESULT: 
RETURN CODE: 0
PASS
######################################################################################
# NEW TEST: ## Install Development tools group...
######################################################################################
COMMAND:  /usr/bin/yum -y groupinstall 'Development tools'
RESULT: Loaded plugins: amazon-id, rhui-lb, security
Setting up Group Process
Package gcc-4.4.5-6.el6.i686 already installed and latest version
Package 1:make-3.81-19.el6.i686 already installed and latest version
Package patch-2.6-6.el6.i686 already installed and latest version
Package 1:pkgconfig-0.23-9.1.el6.i686 already installed and latest version
Package gettext-0.17-16.el6.i686 already installed and latest version
Package binutils-2.20.51.0.2-5.20.el6_1.1.i686 already installed and latest version
Package elfutils-0.152-1.el6.i686 already installed and latest version
Package cvs-1.11.23-11.el6_0.1.i686 already installed and latest version
Package subversion-1.6.11-2.el6_1.4.i686 already installed and latest version
Resolving Dependencies
--> Running transaction check
---> Package autoconf.noarch 0:2.63-5.1.el6 will be installed
---> Package automake.noarch 0:1.11.1-1.2.el6 will be installed
---> Package bison.i686 0:2.4.1-5.el6 will be installed
---> Package byacc.i686 0:1.9.20070509-6.1.el6 will be installed
---> Package cscope.i686 0:15.6-6.el6 will be installed
---> Package ctags.i686 0:5.8-2.el6 will be installed
---> Package diffstat.i686 0:1.51-2.el6 will be installed

Comment 4 Kedar Bidarkar 2011-09-19 14:58:52 UTC
---> Package doxygen.i686 1:1.6.1-4.el6 will be installed
---> Package flex.i686 0:2.5.35-8.el6 will be installed
---> Package gcc-c++.i686 0:4.4.5-6.el6 will be installed
--> Processing Dependency: libstdc++-devel = 4.4.5-6.el6 for package: gcc-c++-4.4.5-6.el6.i686
---> Package gcc-gfortran.i686 0:4.4.5-6.el6 will be installed
---> Package git.i686 0:1.7.1-2.el6_0.1 will be installed
--> Processing Dependency: perl-Git = 1.7.1-2.el6_0.1 for package: git-1.7.1-2.el6_0.1.i686
--> Processing Dependency: perl(Error) for package: git-1.7.1-2.el6_0.1.i686
--> Processing Dependency: perl(Git) for package: git-1.7.1-2.el6_0.1.i686
---> Package indent.i686 0:2.2.10-5.1.el6 will be installed
---> Package intltool.noarch 0:0.41.0-1.1.el6 will be installed
--> Processing Dependency: gettext-devel for package: intltool-0.41.0-1.1.el6.noarch
---> Package libtool.i686 0:2.2.6-15.5.el6 will be installed
---> Package patchutils.i686 0:0.3.1-3.1.el6 will be installed
---> Package rcs.i686 0:5.7-37.el6 will be installed
---> Package redhat-rpm-config.noarch 0:9.0.3-33.el6 will be installed
---> Package rpm-build.i686 0:4.8.0-16.el6 will be installed
---> Package swig.i686 0:1.3.40-5.el6 will be installed
---> Package systemtap.i686 0:1.4-6.el6_1.3 will be installed
--> Running transaction check
---> Package gettext-devel.i686 0:0.17-16.el6 will be installed
--> Processing Dependency: gettext-libs = 0.17-16.el6 for package: gettext-devel-0.17-16.el6.i686
--> Processing Dependency: libasprintf.so.0 for package: gettext-devel-0.17-16.el6.i686
--> Processing Dependency: libgettextpo.so.0 for package: gettext-devel-0.17-16.el6.i686
---> Package libstdc++-devel.i686 0:4.4.5-6.el6 will be installed
---> Package perl-Error.noarch 1:0.17015-4.el6 will be installed
---> Package perl-Git.noarch 0:1.7.1-2.el6_0.1 will be installed
--> Running transaction check
---> Package gettext-libs.i686 0:0.17-16.el6 will be installed
--> Finished Dependency Resolution

Dependencies Resolved

================================================================================
 Package         Arch   Version         Repository                         Size
================================================================================
Installing:
 autoconf        noarch 2.63-5.1.el6    rhui-us-west-rhel-server-releases 781 k
 automake        noarch 1.11.1-1.2.el6  rhui-us-west-rhel-server-releases 550 k
 bison           i686   2.4.1-5.el6     rhui-us-west-rhel-server-releases 626 k
 byacc           i686   1.9.20070509-6.1.el6
                                        rhui-us-west-rhel-server-releases  44 k
 cscope          i686   15.6-6.el6      rhui-us-west-rhel-server-releases 130 k
 ctags           i686   5.8-2.el6       rhui-us-west-rhel-server-releases 142 k
 diffstat        i686   1.51-2.el6      rhui-us-west-rhel-server-releases  29 k
 doxygen         i686   1:1.6.1-4.el6   rhui-us-west-rhel-server-releases 2.3 M
 flex            i686   2.5.35-8.el6    rhui-us-west-rhel-server-releases 279 k
 gcc-c++         i686   4.4.5-6.el6     rhui-us-west-rhel-server-releases 4.3 M
 gcc-gfortran    i686   4.4.5-6.el6     rhui-us-west-rhel-server-releases 4.1 M
 git             i686   1.7.1-2.el6_0.1 rhui-us-west-rhel-server-releases 4.5 M
 indent          i686   2.2.10-5.1.el6  rhui-us-west-rhel-server-releases 111 k
 intltool        noarch 0.41.0-1.1.el6  rhui-us-west-rhel-server-releases  58 k
 libtool         i686   2.2.6-15.5.el6  rhui-us-west-rhel-server-releases 564 k
 patchutils      i686   0.3.1-3.1.el6   rhui-us-west-rhel-server-releases  94 k
 rcs             i686   5.7-37.el6      rhui-us-west-rhel-server-releases 169 k
 redhat-rpm-config
                 noarch 9.0.3-33.el6    rhui-us-west-rhel-server-releases  57 k
 rpm-build       i686   4.8.0-16.el6    rhui-us-west-rhel-server-releases 124 k
 swig            i686   1.3.40-5.el6    rhui-us-west-rhel-server-releases 1.1 M
 systemtap       i686   1.4-6.el6_1.3   rhui-us-west-rhel-server-releases 2.8 M
Installing for dependencies:
 gettext-devel   i686   0.17-16.el6     rhui-us-west-rhel-server-releases 153 k
 gettext-libs    i686   0.17-16.el6     rhui-us-west-rhel-server-releases 110 k
 libstdc++-devel i686   4.4.5-6.el6     rhui-us-west-rhel-server-releases 1.5 M
 perl-Error      noarch 1:0.17015-4.el6 rhui-us-west-rhel-server-releases  29 k
 perl-Git        noarch 1.7.1-2.el6_0.1 rhui-us-west-rhel-server-releases  28 k

Transaction Summary
================================================================================
Install      26 Package(s)

Total download size: 25 M
Installed size: 25 M
Downloading Packages:
--------------------------------------------------------------------------------
Total                                           4.3 MB/s |  25 MB     00:05     
Running rpm_check_debug
Running Transaction Test
Transaction Test Succeeded
Running Transaction

  Installing : 1:perl-Error-0.17015-4.el6.noarch                           1/26 

  Installing : autoconf-2.63-5.1.el6.noarch                                2/26 

  Installing : automake-1.11.1-1.2.el6.noarch                              3/26 

  Installing : git-1.7.1-2.el6_0.1.i686                                    4/26 

  Installing : perl-Git-1.7.1-2.el6_0.1.noarch                             5/26 

  Installing : libstdc++-devel-4.4.5-6.el6.i686                            6/26 

  Installing : libtool-2.2.6-15.5.el6.i686                                 7/26 

  Installing : redhat-rpm-config-9.0.3-33.el6.noarch                       8/26 

  Installing : gettext-libs-0.17-16.el6.i686                               9/26 

  Installing : gettext-devel-0.17-16.el6.i686                             10/26 

  Installing : intltool-0.41.0-1.1.el6.noarch                             11/26 

  Installing : gcc-c++-4.4.5-6.el6.i686                                   12/26 

  Installing : rcs-5.7-37.el6.i686                                        13/26 

  Installing : cscope-15.6-6.el6.i686                                     14/26 

  Installing : indent-2.2.10-5.1.el6.i686                                 15/26 

  Installing : swig-1.3.40-5.el6.i686                                     16/26 

  Installing : patchutils-0.3.1-3.1.el6.i686                              17/26 

  Installing : bison-2.4.1-5.el6.i686                                     18/26 

  Installing : ctags-5.8-2.el6.i686                                       19/26 

  Installing : byacc-1.9.20070509-6.1.el6.i686                            20/26 

  Installing : rpm-build-4.8.0-16.el6.i686                                21/26 

  Installing : 1:doxygen-1.6.1-4.el6.i686                                 22/26 

  Installing : diffstat-1.51-2.el6.i686                                   23/26 

  Installing : gcc-gfortran-4.4.5-6.el6.i686                              24/26 

  Installing : flex-2.5.35-8.el6.i686                                     25/26 

  Installing : systemtap-1.4-6.el6_1.3.i686                               26/26 

Installed:
  autoconf.noarch 0:2.63-5.1.el6     automake.noarch 0:1.11.1-1.2.el6          
  bison.i686 0:2.4.1-5.el6           byacc.i686 0:1.9.20070509-6.1.el6         
  cscope.i686 0:15.6-6.el6           ctags.i686 0:5.8-2.el6                    
  diffstat.i686 0:1.51-2.el6         doxygen.i686 1:1.6.1-4.el6                
  flex.i686 0:2.5.35-8.el6           gcc-c++.i686 0:4.4.5-6.el6                
  gcc-gfortran.i686 0:4.4.5-6.el6    git.i686 0:1.7.1-2.el6_0.1                
  indent.i686 0:2.2.10-5.1.el6       intltool.noarch 0:0.41.0-1.1.el6          
  libtool.i686 0:2.2.6-15.5.el6      patchutils.i686 0:0.3.1-3.1.el6           
  rcs.i686 0:5.7-37.el6              redhat-rpm-config.noarch 0:9.0.3-33.el6   
  rpm-build.i686 0:4.8.0-16.el6      swig.i686 0:1.3.40-5.el6                  
  systemtap.i686 0:1.4-6.el6_1.3    

Dependency Installed:
  gettext-devel.i686 0:0.17-16.el6        gettext-libs.i686 0:0.17-16.el6       
  libstdc++-devel.i686 0:4.4.5-6.el6      perl-Error.noarch 1:0.17015-4.el6     
  perl-Git.noarch 0:1.7.1-2.el6_0.1      

Complete! 
EXPECTED RESULT: 
RETURN CODE: 0
PASS
######################################################################################
# NEW TEST: ## Verify yum update ... 
######################################################################################
COMMAND:  /usr/bin/yum -y update
RESULT: Loaded plugins: amazon-id, rhui-lb, security
Setting up Update Process
No Packages marked for Update 
EXPECTED RESULT: 
RETURN CODE: 0
PASS
######################################################################################
# NEW TEST: ## Verify no fa1lures in rpm package ... 
######################################################################################
COMMAND:  cat /root/valid/src/validate.log | grep 'failure in rpm package' | wc -l
RESULT: 1 
EXPECTED RESULT: 1
RETURN CODE: 0
PASS
######################################################################################
# NEW TEST: ## Verify no rpm scriplet fa1lures ... 
######################################################################################
COMMAND:  cat /root/valid/src/validate.log | grep 'scriptlet failed, exit status 1' | wc -l
RESULT: 1 
EXPECTED RESULT: 1
RETURN CODE: 0
PASS
######################################################################################
# NEW TEST: ## Verify package removal... 
######################################################################################
COMMAND: /bin/rpm -e zsh
RETURN CODE: 0
COMMAND:  /bin/rpm -q zsh
RESULT: package zsh is not installed 
EXPECTED RESULT: package zsh is not installed
RETURN CODE: 1
PASS
######################################################################################
# NEW TEST: ## Verify bash_history ... 
######################################################################################
COMMAND:  cat ~/.bash_history | wc -l 
cat: /root/.bash_history: No such file or directory
RESULT: 0 
EXPECTED RESULT: 0
RETURN CODE: 0
PASS
######################################################################################
# NEW TEST: ## Verify no systemid file ... 
######################################################################################
COMMAND:  echo true
RESULT: true 
EXPECTED RESULT: 
RETURN CODE: 0
PASS
######################################################################################
# NEW TEST: ## Verify rh-cloud-firstboot is OFF ... 
######################################################################################
COMMAND:  chkconfig --list | grep rh-cloud | grep 3:off | wc -l
RESULT: 1 
EXPECTED RESULT: 1
RETURN CODE: 0
PASS
/etc/sysconfig/rh-cloud-firstboot FOUND
COMMAND:  echo true
RESULT: true 
EXPECTED RESULT: 
RETURN CODE: 0
PASS
COMMAND:  cat /etc/sysconfig/rh-cloud-firstboot
RESULT: RUN_FIRSTBOOT=NO 
EXPECTED RESULT: RUN_FIRSTBOOT=NO
RETURN CODE: 0
PASS
######################################################################################
# NEW TEST: ## Verify nameserver ... 
######################################################################################
COMMAND:  /usr/bin/dig clock.redhat.com 2>> /root/valid/src/validate.log | grep 66.187.233.4  | wc -l
RESULT: 1 
EXPECTED RESULT: 
RETURN CODE: 0
PASS
######################################################################################
# NEW TEST: ## Verify group file ... 
######################################################################################
COMMAND:  cat /etc/group | grep root:x:0
RESULT: root:x:0:root 
EXPECTED RESULT: root:x:0:root
RETURN CODE: 0
PASS
COMMAND:  cat /etc/group | grep bin:x:1
RESULT: bin:x:1:root,bin,daemon 
EXPECTED RESULT: bin:x:1:root,bin,daemon
RETURN CODE: 0
PASS
COMMAND:  cat /etc/group | grep daemon:x:2
RESULT: daemon:x:2:root,bin,daemon 
EXPECTED RESULT: daemon:x:2:root,bin,daemon
RETURN CODE: 0
PASS
COMMAND:  cat /etc/group | grep nobody:x:99
RESULT: nobody:x:99: 
EXPECTED RESULT: nobody:x:99:
RETURN CODE: 0
PASS
######################################################################################
# NEW TEST: ## Verify new passwd file ... 
######################################################################################
COMMAND:  cat /etc/passwd | grep root:x:0
RESULT: root:x:0:0:root:/root:/bin/bash 
EXPECTED RESULT: root:x:0:0:root:/root:/bin/bash
RETURN CODE: 0
PASS
COMMAND:  cat /etc/passwd | grep nobody:x:99
RESULT: nobody:x:99:99:Nobody:/:/sbin/nologin 
EXPECTED RESULT: nobody:x:99:99:Nobody:/:/sbin/nologin
RETURN CODE: 0
PASS
COMMAND:  cat /etc/passwd | grep sshd
RESULT: sshd:x:74:74:Privilege-separated SSH:/var/empty/sshd:/sbin/nologin 
EXPECTED RESULT: sshd:x:74:74:Privilege-separated SSH:/var/empty/sshd:/sbin/nologin
RETURN CODE: 0
PASS
######################################################################################
# NEW TEST: ## Verify runlevel ... 
######################################################################################
COMMAND:  cat /etc/inittab | grep id:
RESULT: id:3:initdefault: 
EXPECTED RESULT: id:3:initdefault:
RETURN CODE: 0
PASS
######################################################################################
# NEW TEST: ## Verify new shells file ... 
######################################################################################
COMMAND:  cat /etc/shells | grep bash
RESULT: /bin/bash 
EXPECTED RESULT: /bin/bash
RETURN CODE: 0
PASS
COMMAND:  cat /etc/shells | grep nologin
RESULT: /sbin/nologin 
EXPECTED RESULT: /sbin/nologin
RETURN CODE: 0
PASS
######################################################################################
# NEW TEST: ## Verify networking ... 
######################################################################################
COMMAND:  grep ^NETWORKING= /etc/sysconfig/network | cut -d\= -f2
RESULT: yes 
EXPECTED RESULT: yes
RETURN CODE: 0
PASS
######################################################################################
# NEW TEST: ## Verify device ... 
######################################################################################
COMMAND:  grep ^DEVICE= /etc/sysconfig/network-scripts/ifcfg-eth0 | cut -d\= -f2
RESULT: eth0 
EXPECTED RESULT: eth0
RETURN CODE: 0
PASS
######################################################################################
# NEW TEST: ## Verify iptables ... 
######################################################################################
COMMAND: /etc/init.d/iptables status | grep REJECT 
5    REJECT     all  --  0.0.0.0/0            0.0.0.0/0           reject-with icmp-host-prohibited 
1    REJECT     all  --  0.0.0.0/0            0.0.0.0/0           reject-with icmp-host-prohibited 
RETURN CODE: 0
COMMAND:  /etc/init.d/iptables status | grep :22 | grep ACCEPT | wc -l 
RESULT: 1 
EXPECTED RESULT: 1
RETURN CODE: 0
PASS
######################################################################################
# NEW TEST: ## Verify sshd ...
######################################################################################
COMMAND:  chkconfig --list | grep sshd
RESULT: sshd           	0:off	1:off	2:on	3:on	4:on	5:on	6:off 
EXPECTED RESULT: sshd           	0:off	1:off	2:on	3:on	4:on	5:on	6:off
RETURN CODE: 0
PASS
COMMAND:  /etc/init.d/sshd status | grep running | wc -l
RESULT: 1 
EXPECTED RESULT: 1
RETURN CODE: 0
PASS
######################################################################################
# NEW TEST: ## Verify  chkconfig ... 
######################################################################################
COMMAND:  chkconfig --list | grep crond | cut -f 5
RESULT: 3:on 
EXPECTED RESULT: 3:on
RETURN CODE: 0
PASS
COMMAND:  chkconfig --list | grep  iptables | cut -f 5
RESULT: 3:on 
EXPECTED RESULT: 3:on
RETURN CODE: 0
PASS
######################################################################################
# NEW TEST: ## Verify rsyslog is on ... 
######################################################################################
COMMAND:  chkconfig --list | grep rsyslog | cut -f 5
RESULT: 3:on 
EXPECTED RESULT: 3:on
RETURN CODE: 0
PASS
######################################################################################
# NEW TEST: ## Verify rsyslog config ... 
######################################################################################
COMMAND:  md5sum /etc/rsyslog.conf | cut -f 1 -d  " "
RESULT: dd356958ca9c4e779f7fac13dde3c1b5 
EXPECTED RESULT: dd356958ca9c4e779f7fac13dde3c1b5
RETURN CODE: 0
PASS
######################################################################################
# NEW TEST: ## Verify auditd is on ... 
######################################################################################
COMMAND:  /sbin/chkconfig --list auditd | grep 3:on
RESULT: auditd         	0:off	1:off	2:on	3:on	4:on	5:on	6:off 
EXPECTED RESULT: 
RETURN CODE: 0
PASS
COMMAND:  /sbin/chkconfig --list auditd | grep 5:on
RESULT: auditd         	0:off	1:off	2:on	3:on	4:on	5:on	6:off 
EXPECTED RESULT: 
RETURN CODE: 0
PASS
######################################################################################
# NEW TEST: ## Verify audit.rules ... 
######################################################################################
COMMAND:  md5sum /etc/audit/audit.rules | cut -f 1 -d  " "
RESULT: f9869e1191838c461f5b9051c78a638d 
EXPECTED RESULT: f9869e1191838c461f5b9051c78a638d
RETURN CODE: 0
PASS
######################################################################################
# NEW TEST: ## Verify auditd.conf ... 
######################################################################################
COMMAND:  md5sum /etc/audit/auditd.conf | cut -f 1 -d  " "
RESULT: 612ddf28c3916530d47ef56a1b1ed1ed 
EXPECTED RESULT: 612ddf28c3916530d47ef56a1b1ed1ed
RETURN CODE: 0
PASS
######################################################################################
# NEW TEST: ## Verify auditd sysconfig ... 
######################################################################################
COMMAND:  md5sum /etc/sysconfig/auditd | cut -f 1 -d  " "
RESULT: 123beb3a97a32d96eba4f11509e39da2 
EXPECTED RESULT: 123beb3a97a32d96eba4f11509e39da2
RETURN CODE: 0
PASS
######################################################################################
# NEW TEST: ## Verify sshd_config settings ...
######################################################################################
COMMAND:  cat /etc/ssh/sshd_config  | grep  PasswordAuthentication | grep no | wc -l
RESULT: 1 
EXPECTED RESULT: 1
RETURN CODE: 0
PASS
######################################################################################
# NEW TEST: ## Verify /etc/ld.so.conf.d/libc6-xen.conf is not present ... 
######################################################################################
COMMAND:  ls /etc/ld.so.conf.d/libc6-xen.conf
ls: cannot access /etc/ld.so.conf.d/libc6-xen.conf: No such file or directory
RESULT:  
EXPECTED RESULT: 2
RETURN CODE: 2
PASS
######################################################################################
# NEW TEST: ##test menu.lst ... 
######################################################################################
COMMAND:  file /boot/grub/menu.lst  | grep symbolic | wc -l
RESULT: 1 
EXPECTED RESULT: 1
RETURN CODE: 0
PASS
COMMAND:  file /boot/grub/menu.lst  | grep grub.conf | wc -l
RESULT: 1 
EXPECTED RESULT: 1
RETURN CODE: 0
PASS
COMMAND:  cat /boot/grub/grub.conf  | grep "(hd0,0)" | wc -l
RESULT: 0 
EXPECTED RESULT: 0
RETURN CODE: 0
PASS
######################################################################################
# NEW TEST: ## Verify resize2fs ... 
######################################################################################
COMMAND: resize2fs -p /dev/xvde1 15000M
resize2fs 1.41.12 (17-May-2010)
RETURN CODE: 0
COMMAND:  df -h | grep 15G | wc -l 
RESULT: 1 
EXPECTED RESULT: 1
RETURN CODE: 0
PASS
######################################################################################
# NEW TEST: Fetching Host Details 
######################################################################################
This Host => ec2-50-18-74-131.us-west-1.compute.amazonaws.com with Image Id : ami-03f3ae46, is launched with Instance Id : i-73924a34 , Instance Type : t1.micro and Arch : i386 in the Region : us-west-1c
This is a Hourly image
The Validate Signature is : P7fb5zOAbXcgaPO8DmJQOflHW8wgBQow/7DeBpQbSXwfjrpZVoxG9hZ9eJKjYYTV733HodhknSKj
WbRe1JeUfAfSq6ydzgMeyQ/3DoTHidXrQP6blmTTqYY5g4knsvzy6bJO96VXwWPVG64fhi0FMmrl
lBc1Ih9BfYY2Wa7Cdcc=

## Summary ##
FAILURES = 1
FAILED TESTS = ## Verify RPMs ...
LOG FILE = /root/valid/src/validate.log
## Summary ##

######################################################################################
# NEW TEST: ## Open a bugzilla
######################################################################################

Comment 5 Kedar Bidarkar 2011-09-19 14:59:53 UTC
IMAGE ID= ami-03f3ae46_us-west-1_m1.small
######################################################################################
# NEW TEST: ## Open a bugzilla
######################################################################################
######################################################################################
# NEW TEST: Fetching Host Details 
######################################################################################
This Host => ec2-50-18-0-237.us-west-1.compute.amazonaws.com with Image Id : ami-03f3ae46, is launched with Instance Id : i-7b924a3c , Instance Type : m1.small and Arch : i386 in the Region : us-west-1b
This is a Hourly image
The Validate Signature is : ZVVL820PhRMOWImQL30tXB0dJaNUHVHXgeZmpJLdZzSiu5qSHCcDxXLLjIXBg5ppVtQXFUc9wru/
STt7Dj+Rt+ujP5Y2LrPp3dMKDEVM6eLyvAeDJ3WUIhpB0CpQPeC6X1AGSTpzAhDMUMvsl5g0F0mu
MrgX634pXr1eufbDESc=
/root/valid/src
ip-10-168-75-102
Red Hat Enterprise Linux Server release 6.1 (Santiago)
######################################################################################
# NEW TEST: The selected image has the version RHEL 6.1
######################################################################################
######################################################################################
# NEW TEST: ## Verify kernel name ... 
######################################################################################
COMMAND:  /bin/uname -s
RESULT: Linux 
EXPECTED RESULT: Linux
RETURN CODE: 0
PASS
######################################################################################
# NEW TEST: ## Verify latest installed kernel is running ... 
######################################################################################
RHEL VERSION IS 6
LATEST_RPM_KERNEL_VERSION=rpm -q kernel --last | head -n 1 |  cut -c 8-60 | cut -d ' ' -f 1
CURRENT_UNAME_KERNAL_VERSION=2.6.32-131.12.1.el6
assert latest rpm kernel = uname -r
COMMAND:  uname -r | sed  's/\(.*\)...../\1/'
RESULT: 2.6.32-131.12.1.el6 
EXPECTED RESULT: 2.6.32-131.12.1.el6
RETURN CODE: 0
PASS
######################################################################################
# NEW TEST: ## Verify latest kenerl is in /boot/grub/menu.1st ... 
######################################################################################
COMMAND:  cat /boot/grub/menu.lst | grep 2.6.32-131.12.1.el6
RESULT: title RHEL-6.1-Starter-EBS-i386-6 (2.6.32-131.12.1.el6.i686)
        kernel /boot/vmlinuz-2.6.32-131.12.1.el6.i686 ro root=LABEL=_/ 
        initrd /boot/initramfs-2.6.32-131.12.1.el6.i686.img 
EXPECTED RESULT: 
RETURN CODE: 0
PASS
######################################################################################
# NEW TEST: ## Verify operating system ... 
######################################################################################
COMMAND:  /bin/uname -o
RESULT: GNU/Linux 
EXPECTED RESULT: GNU/Linux
RETURN CODE: 0
PASS
######################################################################################
# NEW TEST: ## Verify /etc/sysconfig/kernel ... 
######################################################################################
COMMAND:  ls /etc/sysconfig/kernel
RESULT: /etc/sysconfig/kernel 
EXPECTED RESULT: 
RETURN CODE: 0
PASS
######################################################################################
# NEW TEST: ## Verify /etc/sysconfig/kernel contains UPDATEDEFAULT ... 
######################################################################################
COMMAND:  cat /etc/sysconfig/kernel | grep UPDATEDEFAULT=yes
RESULT: UPDATEDEFAULT=yes 
EXPECTED RESULT: 
RETURN CODE: 0
PASS
######################################################################################
# NEW TEST: ## Verify /etc/sysconfig/kernel contains DEFAULTKERNEL ... 
######################################################################################
COMMAND:  cat /etc/sysconfig/kernel | grep DEFAULTKERNEL=kernel
RESULT: DEFAULTKERNEL=kernel 
EXPECTED RESULT: 
RETURN CODE: 0
PASS
######################################################################################
# NEW TEST: ## Partition Format  ...
######################################################################################
mount | grep /dev/xvde1 | awk '{ print  }'
COMMAND:  echo ext4
RESULT: ext4 
EXPECTED RESULT: ext4
RETURN CODE: 0
PASS
######################################################################################
# NEW TEST: ## Partition Size ...
######################################################################################
size=5904752
COMMAND:  echo true
RESULT: true 
EXPECTED RESULT: true
RETURN CODE: 0
PASS
######################################################################################
# NEW TEST: ## Verify turning on/off swap file ... 
######################################################################################
COMMAND:  /sbin/swapoff /dev/xvde3 && /sbin/swapon /dev/xvde3
swapoff: /dev/xvde3: swapoff failed: Invalid argument
RESULT:  
EXPECTED RESULT: 
RETURN CODE: 255
FAIL2

######################################################################################
# NEW TEST: ## Verify swap size ... 
######################################################################################
free | grep Swap | awk '{print }'
COMMAND:  echo false
RESULT: false 
EXPECTED RESULT: 1
RETURN CODE: 0
FAIL2
false
######################################################################################
# NEW TEST: ## /sbin/getenforce ... 
######################################################################################
COMMAND:  /usr/sbin/getenforce
RESULT: Enforcing 
EXPECTED RESULT: Enforcing
RETURN CODE: 0
PASS
######################################################################################
# NEW TEST: ## Verify SELINUX enforcing ... 
######################################################################################
COMMAND:  grep ^SELINUX= /etc/sysconfig/selinux | cut -d\= -f2
RESULT: enforcing 
EXPECTED RESULT: enforcing
RETURN CODE: 0
PASS
######################################################################################
# NEW TEST: ## Verify SELINUXTYPE targeted ... 
######################################################################################
COMMAND:  grep ^SELINUXTYPE= /etc/sysconfig/selinux | cut -d\= -f2
RESULT: targeted 
EXPECTED RESULT: targeted
RETURN CODE: 0
PASS
######################################################################################
# NEW TEST: ## Flip Selinux Permissive ... 
######################################################################################
COMMAND:  /usr/sbin/setenforce Permissive && /usr/sbin/getenforce
RESULT: Permissive 
EXPECTED RESULT: Permissive
RETURN CODE: 0
PASS
######################################################################################
# NEW TEST: ## Flip Selinux Enforcing ... 
######################################################################################
COMMAND:  /usr/sbin/setenforce Enforcing && /usr/sbin/getenforce
RESULT: Enforcing 
EXPECTED RESULT: Enforcing
RETURN CODE: 0
PASS
######################################################################################
# NEW TEST: ## Verify no missing packages ... 
######################################################################################
COMMAND: /bin/rpm -qa --queryformat='%{NAME}\n' > /tmp/rpmqa.tmp
RETURN CODE: 0
COMMAND: comm -23 packages_61 /tmp/rpmqa
RETURN CODE: 0
COUNT = 0
COMMAND:  echo test passed
RESULT: test passed 
EXPECTED RESULT: 0
RETURN CODE: 0
PASS
######################################################################################
# NEW TEST: ## Verify RPMs ... 
######################################################################################
....L....  c /etc/pam.d/fingerprint-auth
....L....  c /etc/pam.d/password-auth
....L....  c /etc/pam.d/smartcard-auth
....L....  c /etc/pam.d/system-auth
.M.......    /var/cache/yum
    S file Size differs
    M Mode differs (includes permissions and file type)
    5 MD5 sum differs
    D Device major/minor number mismatch
    L readLink(2) path mismatch
    U User ownership differs
    G Group ownership differs
    T mTime differs

COMMAND:  cat /tmp/rpmqaV.txt | wc -l
RESULT: 5 
EXPECTED RESULT: 4
RETURN CODE: 0
FAIL2
5
######################################################################################
# NEW TEST: ## Verify Version 2 ... 
######################################################################################
COMMAND:  /bin/rpm -q --queryformat '%{RELEASE}\n' redhat-release-server | cut -d. -f1,2
RESULT: 6.1 
EXPECTED RESULT: 6.1
RETURN CODE: 0
PASS
######################################################################################
# NEW TEST: ## Verify packager ... 
######################################################################################
COMMAND:  cat /tmp/Packager | grep -v 'Red Hat, Inc.' |  grep -v crash-trace-commandPackager| wc -l
RESULT: 0 
EXPECTED RESULT: 0
RETURN CODE: 0
PASS
crash-trace-commandPackager    : Lai Jiangshan <laijs@cn.fujitsu.com>
######################################################################################
# NEW TEST: ## Verify GPG checking ... 
######################################################################################
COMMAND:  grep '^gpgcheck=1' /etc/yum.repos.d/redhat-*.repo | cut -d\= -f2 | sort -f | uniq
RESULT: 1 
EXPECTED RESULT: 1
RETURN CODE: 0
PASS
######################################################################################
# NEW TEST: ## Verify GPG Keys ... 
######################################################################################
COMMAND:  rpm -qa gpg-pubkey* | wc -l 
RESULT: 2 
EXPECTED RESULT: 2
RETURN CODE: 0
PASS
COMMAND:  rpm -qa gpg-pubkey* | sort -f | tail -n 1
RESULT: gpg-pubkey-fd431d51-4ae0493b 
EXPECTED RESULT: gpg-pubkey-fd431d51-4ae0493b
RETURN CODE: 0
PASS
COMMAND:  rpm -qa gpg-pubkey* | sort -f | head -n 1
RESULT: gpg-pubkey-2fa658e0-45700c69 
EXPECTED RESULT: gpg-pubkey-2fa658e0-45700c69
RETURN CODE: 0
PASS
######################################################################################
# NEW TEST: ## Verify disabled yum plugin ... 
######################################################################################
COMMAND:  grep ^enabled /etc/yum/pluginconf.d/rhnplugin.conf | grep -v '^#' | cut -d\= -f2 | awk '{print }' | sort -f | uniq
RESULT:  0 
EXPECTED RESULT: 
RETURN CODE: 0
PASS
######################################################################################
# NEW TEST: ## List the configured repositories...
######################################################################################
COMMAND:  /usr/bin/yum repolist
RESULT: Loaded plugins: amazon-id, rhui-lb, security
repo id                                    repo name                      status
rhui-us-west-client-config-server-6        Red Hat Update Infrastructure      0
rhui-us-west-rhel-server-releases          Red Hat Enterprise Linux Serve 4,105
rhui-us-west-rhel-server-releases-optional Red Hat Enterprise Linux Serve 2,623
repolist: 6,728 
EXPECTED RESULT: 
RETURN CODE: 0
PASS
######################################################################################
# NEW TEST: ## Search zsh...
######################################################################################
COMMAND:  /usr/bin/yum search zsh
RESULT: Loaded plugins: amazon-id, rhui-lb, security
=============================== N/S Matched: zsh ===============================
python-twisted-core-zsh.i686 : Tab completion for Zsh and Twisted Core
zsh-html.i686 : Zsh shell manual in html format
zsh.i686 : A powerful interactive shell

  Name and summary matches only, use "search all" for everything. 
EXPECTED RESULT: 
RETURN CODE: 0
PASS
######################################################################################
# NEW TEST: ## install zsh ... 
######################################################################################
COMMAND: /usr/bin/yum -y install zsh
RETURN CODE: 0
COMMAND:  /bin/rpm -q --queryformat '%{NAME}\n' zsh
RESULT: zsh 
EXPECTED RESULT: zsh
RETURN CODE: 0
PASS
######################################################################################
# NEW TEST: ## List available groups..
######################################################################################
COMMAND:  /usr/bin/yum grouplist
RESULT: Loaded plugins: amazon-id, rhui-lb, security
Setting up Group Process
Installed Groups:
   Additional Development
   Base
   Compatibility libraries
   Console internet tools
   Desktop Platform
   Directory Client
   E-mail server
   Fonts
   Graphical Administration Tools
   Hardware monitoring utilities
   Java Platform
   Large Systems Performance
   Legacy UNIX compatibility
   Legacy X Window System compatibility
   Network file system client
   Networking Tools
   Performance Tools
   Perl Support
   PostgreSQL Database client
   PostgreSQL Database server
   SNMP Support
   Scientific support
   Server Platform
   Smart card support
   System administration tools
   Web Server
Installed Language Groups:
   Arabic Support [ar]
   Armenian Support [hy]
   French Support [fr]
   Georgian Support [ka]
   Hebrew Support [he]
   Inuktitut Support [iu]
   Italian Support [it]
   Japanese Support [ja]
   Korean Support [ko]
   Lao Support [lo]
   Polish Support [pl]
   Russian Support [ru]
   Spanish Support [es]
   Tajik Support [tg]
Available Groups:
   Backup Client
   Backup Server
   CIFS file server
   Client management tools
   Debugging Tools
   Desktop
   Desktop Debugging and Performance Tools
   Desktop Platform Development
   Development tools
   Dial-up Networking Support
   Directory Server
   Eclipse
   Emacs
   Enterprise Identity Server Base
   FCoE Storage Client
   FTP server
   General Purpose Desktop
   Graphics Creation Tools
   Infiniband Support
   Input Methods
   Internet Applications
   Internet Browser
   KDE Desktop
   Mainframe Access
   Messaging Client Support
   MySQL Database client
   MySQL Database server
   NFS file server
   Network Infrastructure Server
   Network Storage Server
   Office Suite and Productivity
   PHP Support
   Print Server
   Printing client
   Remote Desktop Clients
   Security Tools
   Server Platform Development
   Somali Support
   Storage Availability Tools
   System Management
   Systems Management Messaging Server support
   TeX support
   Technical Writing
   TurboGears application framework
   Virtualization
   Virtualization Client
   Virtualization Platform
   Virtualization Tools
   Web Servlet Engine
   Web-Based Enterprise Management
   X Window System
   iSCSI Storage Client
Available Language Groups:
   Afrikaans Support [af]
   Albanian Support [sq]
   Amazigh Support [ber]
   Assamese Support [as]
   Azerbaijani Support [az]
   Basque Support [eu]
   Belarusian Support [be]
   Bengali Support [bn]
   Bhutanese Support [dz]
   Brazilian Portuguese Support [pt_BR]
   Breton Support [br]
   Bulgarian Support [bg]
   Catalan Support [ca]
   Chhattisgarhi Support [hne]
   Chichewa Support [ny]
   Chinese Support [zh]
   Coptic Support [cop]
   Croatian Support [hr]
   Czech Support [cs]
   Danish Support [da]
   Dutch Support [nl]
   English (UK) Support [en_GB]
   Esperanto Support [eo]
   Estonian Support [et]
   Ethiopic Support [am]
   Faroese Support [fo]
   Fijian Support [fj]
   Filipino Support [fil]
   Finnish Support [fi]
   Frisian Support [fy]
   Friulian Support [fur]
   Gaelic Support [gd]
   Galician Support [gl]
   German Support [de]
   Greek Support [el]
   Gujarati Support [gu]
   Hiligaynon Support [hil]
   Hindi Support [hi]
   Hungarian Support [hu]
   Icelandic Support [is]
   Indonesian Support [id]
   Interlingua Support [ia]
   Irish Support [ga]
   Kannada Support [kn]
   Kashmiri Support [ks]
   Kashubian Support [csb]
   Kazakh Support [kk]
   Khmer Support [km]
   Kinyarwanda Support [rw]
   Konkani Support [kok]
   Kurdish Support [ku]
   Latin Support [la]
   Latvian Support [lv]
   Lithuanian Support [lt]
   Low Saxon Support [nds]
   Luxembourgish Support [lb]
   Macedonian Support [mk]
   Maithili Support [mai]
   Malagasy Support [mg]
   Malay Support [ms]
   Malayalam Support [ml]
   Maltese Support [mt]
   Manx Support [gv]
   Maori Support [mi]
   Marathi Support [mr]
   Mongolian Support [mn]
   Myanmar (Burmese) Support [my]
   Nepali Support [ne]
   Northern Sotho Support [nso]
   Norwegian Support [nb]
   Occitan Support [oc]
   Oriya Support [or]
   Persian Support [fa]
   Portuguese Support [pt]
   Punjabi Support [pa]
   Romanian Support [ro]
   Sanskrit Support [sa]
   Sardinian Support [sc]
   Serbian Support [sr]
   Sindhi Support [sd]
   Sinhala Support [si]
   Slovak Support [sk]
   Slovenian Support [sl]
   Southern Ndebele Support [nr]
   Southern Sotho Support [st]
   Swahili Support [sw]
   Swati Support [ss]
   Swedish Support [sv]
   Tagalog Support [tl]
   Tamil Support [ta]
   Telugu Support [te]
   Tetum Support [tet]
   Thai Support [th]
   Tibetan Support [bo]
   Tsonga Support [ts]
   Tswana Support [tn]
   Turkish Support [tr]
   Turkmen Support [tk]
   Ukrainian Support [uk]
   Upper Sorbian Support [hsb]
   Urdu Support [ur]
   Uzbek Support [uz]
   Venda Support [ve]
   Vietnamese Support [vi]
   Walloon Support [wa]
   Welsh Support [cy]
   Xhosa Support [xh]
   Zulu Support [zu]
Done 
EXPECTED RESULT: 
RETURN CODE: 0
PASS
######################################################################################
# NEW TEST: ## Install Development tools group...
######################################################################################
COMMAND:  /usr/bin/yum -y groupinstall 'Development tools'

Comment 6 Kedar Bidarkar 2011-09-19 14:59:56 UTC
RESULT: Loaded plugins: amazon-id, rhui-lb, security
Setting up Group Process
Package gcc-4.4.5-6.el6.i686 already installed and latest version
Package 1:make-3.81-19.el6.i686 already installed and latest version
Package patch-2.6-6.el6.i686 already installed and latest version
Package 1:pkgconfig-0.23-9.1.el6.i686 already installed and latest version
Package gettext-0.17-16.el6.i686 already installed and latest version
Package binutils-2.20.51.0.2-5.20.el6_1.1.i686 already installed and latest version
Package elfutils-0.152-1.el6.i686 already installed and latest version
Package cvs-1.11.23-11.el6_0.1.i686 already installed and latest version
Package subversion-1.6.11-2.el6_1.4.i686 already installed and latest version
Resolving Dependencies
--> Running transaction check
---> Package autoconf.noarch 0:2.63-5.1.el6 will be installed
---> Package automake.noarch 0:1.11.1-1.2.el6 will be installed
---> Package bison.i686 0:2.4.1-5.el6 will be installed
---> Package byacc.i686 0:1.9.20070509-6.1.el6 will be installed
---> Package cscope.i686 0:15.6-6.el6 will be installed
---> Package ctags.i686 0:5.8-2.el6 will be installed
---> Package diffstat.i686 0:1.51-2.el6 will be installed
---> Package doxygen.i686 1:1.6.1-4.el6 will be installed
---> Package flex.i686 0:2.5.35-8.el6 will be installed
---> Package gcc-c++.i686 0:4.4.5-6.el6 will be installed
--> Processing Dependency: libstdc++-devel = 4.4.5-6.el6 for package: gcc-c++-4.4.5-6.el6.i686
---> Package gcc-gfortran.i686 0:4.4.5-6.el6 will be installed
---> Package git.i686 0:1.7.1-2.el6_0.1 will be installed
--> Processing Dependency: perl-Git = 1.7.1-2.el6_0.1 for package: git-1.7.1-2.el6_0.1.i686
--> Processing Dependency: perl(Error) for package: git-1.7.1-2.el6_0.1.i686
--> Processing Dependency: perl(Git) for package: git-1.7.1-2.el6_0.1.i686
---> Package indent.i686 0:2.2.10-5.1.el6 will be installed
---> Package intltool.noarch 0:0.41.0-1.1.el6 will be installed
--> Processing Dependency: gettext-devel for package: intltool-0.41.0-1.1.el6.noarch
---> Package libtool.i686 0:2.2.6-15.5.el6 will be installed
---> Package patchutils.i686 0:0.3.1-3.1.el6 will be installed
---> Package rcs.i686 0:5.7-37.el6 will be installed
---> Package redhat-rpm-config.noarch 0:9.0.3-33.el6 will be installed
---> Package rpm-build.i686 0:4.8.0-16.el6 will be installed
---> Package swig.i686 0:1.3.40-5.el6 will be installed
---> Package systemtap.i686 0:1.4-6.el6_1.3 will be installed
--> Running transaction check
---> Package gettext-devel.i686 0:0.17-16.el6 will be installed
--> Processing Dependency: gettext-libs = 0.17-16.el6 for package: gettext-devel-0.17-16.el6.i686
--> Processing Dependency: libasprintf.so.0 for package: gettext-devel-0.17-16.el6.i686
--> Processing Dependency: libgettextpo.so.0 for package: gettext-devel-0.17-16.el6.i686
---> Package libstdc++-devel.i686 0:4.4.5-6.el6 will be installed
---> Package perl-Error.noarch 1:0.17015-4.el6 will be installed
---> Package perl-Git.noarch 0:1.7.1-2.el6_0.1 will be installed
--> Running transaction check
---> Package gettext-libs.i686 0:0.17-16.el6 will be installed
--> Finished Dependency Resolution

Dependencies Resolved

================================================================================
 Package         Arch   Version         Repository                         Size
================================================================================
Installing:
 autoconf        noarch 2.63-5.1.el6    rhui-us-west-rhel-server-releases 781 k
 automake        noarch 1.11.1-1.2.el6  rhui-us-west-rhel-server-releases 550 k
 bison           i686   2.4.1-5.el6     rhui-us-west-rhel-server-releases 626 k
 byacc           i686   1.9.20070509-6.1.el6
                                        rhui-us-west-rhel-server-releases  44 k
 cscope          i686   15.6-6.el6      rhui-us-west-rhel-server-releases 130 k
 ctags           i686   5.8-2.el6       rhui-us-west-rhel-server-releases 142 k
 diffstat        i686   1.51-2.el6      rhui-us-west-rhel-server-releases  29 k
 doxygen         i686   1:1.6.1-4.el6   rhui-us-west-rhel-server-releases 2.3 M
 flex            i686   2.5.35-8.el6    rhui-us-west-rhel-server-releases 279 k
 gcc-c++         i686   4.4.5-6.el6     rhui-us-west-rhel-server-releases 4.3 M
 gcc-gfortran    i686   4.4.5-6.el6     rhui-us-west-rhel-server-releases 4.1 M
 git             i686   1.7.1-2.el6_0.1 rhui-us-west-rhel-server-releases 4.5 M
 indent          i686   2.2.10-5.1.el6  rhui-us-west-rhel-server-releases 111 k
 intltool        noarch 0.41.0-1.1.el6  rhui-us-west-rhel-server-releases  58 k
 libtool         i686   2.2.6-15.5.el6  rhui-us-west-rhel-server-releases 564 k
 patchutils      i686   0.3.1-3.1.el6   rhui-us-west-rhel-server-releases  94 k
 rcs             i686   5.7-37.el6      rhui-us-west-rhel-server-releases 169 k
 redhat-rpm-config
                 noarch 9.0.3-33.el6    rhui-us-west-rhel-server-releases  57 k
 rpm-build       i686   4.8.0-16.el6    rhui-us-west-rhel-server-releases 124 k
 swig            i686   1.3.40-5.el6    rhui-us-west-rhel-server-releases 1.1 M
 systemtap       i686   1.4-6.el6_1.3   rhui-us-west-rhel-server-releases 2.8 M
Installing for dependencies:
 gettext-devel   i686   0.17-16.el6     rhui-us-west-rhel-server-releases 153 k
 gettext-libs    i686   0.17-16.el6     rhui-us-west-rhel-server-releases 110 k
 libstdc++-devel i686   4.4.5-6.el6     rhui-us-west-rhel-server-releases 1.5 M
 perl-Error      noarch 1:0.17015-4.el6 rhui-us-west-rhel-server-releases  29 k
 perl-Git        noarch 1.7.1-2.el6_0.1 rhui-us-west-rhel-server-releases  28 k

Transaction Summary
================================================================================
Install      26 Package(s)

Total download size: 25 M
Installed size: 25 M
Downloading Packages:
--------------------------------------------------------------------------------
Total                                           4.3 MB/s |  25 MB     00:05     
Running rpm_check_debug
Running Transaction Test
Transaction Test Succeeded
Running Transaction

  Installing : 1:perl-Error-0.17015-4.el6.noarch                           1/26 

  Installing : autoconf-2.63-5.1.el6.noarch                                2/26 

  Installing : automake-1.11.1-1.2.el6.noarch                              3/26 

  Installing : git-1.7.1-2.el6_0.1.i686                                    4/26 

  Installing : perl-Git-1.7.1-2.el6_0.1.noarch                             5/26 

  Installing : libstdc++-devel-4.4.5-6.el6.i686                            6/26 

  Installing : libtool-2.2.6-15.5.el6.i686                                 7/26 

  Installing : redhat-rpm-config-9.0.3-33.el6.noarch                       8/26 

  Installing : gettext-libs-0.17-16.el6.i686                               9/26 

  Installing : gettext-devel-0.17-16.el6.i686                             10/26 

  Installing : intltool-0.41.0-1.1.el6.noarch                             11/26 

  Installing : gcc-c++-4.4.5-6.el6.i686                                   12/26 

  Installing : rcs-5.7-37.el6.i686                                        13/26 

  Installing : cscope-15.6-6.el6.i686                                     14/26 

  Installing : indent-2.2.10-5.1.el6.i686                                 15/26 

  Installing : swig-1.3.40-5.el6.i686                                     16/26 

  Installing : patchutils-0.3.1-3.1.el6.i686                              17/26 

  Installing : bison-2.4.1-5.el6.i686                                     18/26 

  Installing : ctags-5.8-2.el6.i686                                       19/26 

  Installing : byacc-1.9.20070509-6.1.el6.i686                            20/26 

  Installing : rpm-build-4.8.0-16.el6.i686                                21/26 

  Installing : 1:doxygen-1.6.1-4.el6.i686                                 22/26 

  Installing : diffstat-1.51-2.el6.i686                                   23/26 

  Installing : gcc-gfortran-4.4.5-6.el6.i686                              24/26 

  Installing : flex-2.5.35-8.el6.i686                                     25/26 

  Installing : systemtap-1.4-6.el6_1.3.i686                               26/26 

Installed:
  autoconf.noarch 0:2.63-5.1.el6     automake.noarch 0:1.11.1-1.2.el6          
  bison.i686 0:2.4.1-5.el6           byacc.i686 0:1.9.20070509-6.1.el6         
  cscope.i686 0:15.6-6.el6           ctags.i686 0:5.8-2.el6                    
  diffstat.i686 0:1.51-2.el6         doxygen.i686 1:1.6.1-4.el6                
  flex.i686 0:2.5.35-8.el6           gcc-c++.i686 0:4.4.5-6.el6                
  gcc-gfortran.i686 0:4.4.5-6.el6    git.i686 0:1.7.1-2.el6_0.1                
  indent.i686 0:2.2.10-5.1.el6       intltool.noarch 0:0.41.0-1.1.el6          
  libtool.i686 0:2.2.6-15.5.el6      patchutils.i686 0:0.3.1-3.1.el6           
  rcs.i686 0:5.7-37.el6              redhat-rpm-config.noarch 0:9.0.3-33.el6   
  rpm-build.i686 0:4.8.0-16.el6      swig.i686 0:1.3.40-5.el6                  
  systemtap.i686 0:1.4-6.el6_1.3    

Dependency Installed:
  gettext-devel.i686 0:0.17-16.el6        gettext-libs.i686 0:0.17-16.el6       
  libstdc++-devel.i686 0:4.4.5-6.el6      perl-Error.noarch 1:0.17015-4.el6     
  perl-Git.noarch 0:1.7.1-2.el6_0.1      

Complete! 
EXPECTED RESULT: 
RETURN CODE: 0
PASS
######################################################################################
# NEW TEST: ## Verify yum update ... 
######################################################################################
COMMAND:  /usr/bin/yum -y update
RESULT: Loaded plugins: amazon-id, rhui-lb, security
Setting up Update Process
No Packages marked for Update 
EXPECTED RESULT: 
RETURN CODE: 0
PASS
######################################################################################
# NEW TEST: ## Verify no fa1lures in rpm package ... 
######################################################################################
COMMAND:  cat /root/valid/src/validate.log | grep 'failure in rpm package' | wc -l
RESULT: 1 
EXPECTED RESULT: 1
RETURN CODE: 0
PASS
######################################################################################
# NEW TEST: ## Verify no rpm scriplet fa1lures ... 
######################################################################################
COMMAND:  cat /root/valid/src/validate.log | grep 'scriptlet failed, exit status 1' | wc -l
RESULT: 1 
EXPECTED RESULT: 1
RETURN CODE: 0
PASS
######################################################################################
# NEW TEST: ## Verify package removal... 
######################################################################################
COMMAND: /bin/rpm -e zsh
RETURN CODE: 0
COMMAND:  /bin/rpm -q zsh
RESULT: package zsh is not installed 
EXPECTED RESULT: package zsh is not installed
RETURN CODE: 1
PASS
######################################################################################
# NEW TEST: ## Verify bash_history ... 
######################################################################################
COMMAND:  cat ~/.bash_history | wc -l 
cat: /root/.bash_history: No such file or directory
RESULT: 0 
EXPECTED RESULT: 0
RETURN CODE: 0
PASS
######################################################################################
# NEW TEST: ## Verify no systemid file ... 
######################################################################################
COMMAND:  echo true
RESULT: true 
EXPECTED RESULT: 
RETURN CODE: 0
PASS
######################################################################################
# NEW TEST: ## Verify rh-cloud-firstboot is OFF ... 
######################################################################################
COMMAND:  chkconfig --list | grep rh-cloud | grep 3:off | wc -l
RESULT: 1 
EXPECTED RESULT: 1
RETURN CODE: 0
PASS
/etc/sysconfig/rh-cloud-firstboot FOUND
COMMAND:  echo true
RESULT: true 
EXPECTED RESULT: 
RETURN CODE: 0
PASS
COMMAND:  cat /etc/sysconfig/rh-cloud-firstboot
RESULT: RUN_FIRSTBOOT=NO 
EXPECTED RESULT: RUN_FIRSTBOOT=NO
RETURN CODE: 0
PASS
######################################################################################
# NEW TEST: ## Verify nameserver ... 
######################################################################################
COMMAND:  /usr/bin/dig clock.redhat.com 2>> /root/valid/src/validate.log | grep 66.187.233.4  | wc -l
RESULT: 1 
EXPECTED RESULT: 
RETURN CODE: 0
PASS
######################################################################################
# NEW TEST: ## Verify group file ... 
######################################################################################
COMMAND:  cat /etc/group | grep root:x:0
RESULT: root:x:0:root 
EXPECTED RESULT: root:x:0:root
RETURN CODE: 0
PASS
COMMAND:  cat /etc/group | grep bin:x:1
RESULT: bin:x:1:root,bin,daemon 
EXPECTED RESULT: bin:x:1:root,bin,daemon
RETURN CODE: 0
PASS
COMMAND:  cat /etc/group | grep daemon:x:2
RESULT: daemon:x:2:root,bin,daemon 
EXPECTED RESULT: daemon:x:2:root,bin,daemon
RETURN CODE: 0
PASS
COMMAND:  cat /etc/group | grep nobody:x:99
RESULT: nobody:x:99: 
EXPECTED RESULT: nobody:x:99:
RETURN CODE: 0
PASS
######################################################################################
# NEW TEST: ## Verify new passwd file ... 
######################################################################################
COMMAND:  cat /etc/passwd | grep root:x:0
RESULT: root:x:0:0:root:/root:/bin/bash 
EXPECTED RESULT: root:x:0:0:root:/root:/bin/bash
RETURN CODE: 0
PASS
COMMAND:  cat /etc/passwd | grep nobody:x:99
RESULT: nobody:x:99:99:Nobody:/:/sbin/nologin 
EXPECTED RESULT: nobody:x:99:99:Nobody:/:/sbin/nologin
RETURN CODE: 0
PASS
COMMAND:  cat /etc/passwd | grep sshd
RESULT: sshd:x:74:74:Privilege-separated SSH:/var/empty/sshd:/sbin/nologin 
EXPECTED RESULT: sshd:x:74:74:Privilege-separated SSH:/var/empty/sshd:/sbin/nologin
RETURN CODE: 0
PASS
######################################################################################
# NEW TEST: ## Verify runlevel ... 
######################################################################################
COMMAND:  cat /etc/inittab | grep id:
RESULT: id:3:initdefault: 
EXPECTED RESULT: id:3:initdefault:
RETURN CODE: 0
PASS
######################################################################################
# NEW TEST: ## Verify new shells file ... 
######################################################################################
COMMAND:  cat /etc/shells | grep bash
RESULT: /bin/bash 
EXPECTED RESULT: /bin/bash
RETURN CODE: 0
PASS
COMMAND:  cat /etc/shells | grep nologin
RESULT: /sbin/nologin 
EXPECTED RESULT: /sbin/nologin
RETURN CODE: 0
PASS
######################################################################################
# NEW TEST: ## Verify networking ... 
######################################################################################
COMMAND:  grep ^NETWORKING= /etc/sysconfig/network | cut -d\= -f2
RESULT: yes 
EXPECTED RESULT: yes
RETURN CODE: 0
PASS
######################################################################################
# NEW TEST: ## Verify device ... 
######################################################################################
COMMAND:  grep ^DEVICE= /etc/sysconfig/network-scripts/ifcfg-eth0 | cut -d\= -f2
RESULT: eth0 
EXPECTED RESULT: eth0
RETURN CODE: 0
PASS
######################################################################################
# NEW TEST: ## Verify iptables ... 
######################################################################################
COMMAND: /etc/init.d/iptables status | grep REJECT 
5    REJECT     all  --  0.0.0.0/0            0.0.0.0/0           reject-with icmp-host-prohibited 
1    REJECT     all  --  0.0.0.0/0            0.0.0.0/0           reject-with icmp-host-prohibited 
RETURN CODE: 0
COMMAND:  /etc/init.d/iptables status | grep :22 | grep ACCEPT | wc -l 
RESULT: 1 
EXPECTED RESULT: 1
RETURN CODE: 0
PASS
######################################################################################
# NEW TEST: ## Verify sshd ...
######################################################################################
COMMAND:  chkconfig --list | grep sshd
RESULT: sshd           	0:off	1:off	2:on	3:on	4:on	5:on	6:off 
EXPECTED RESULT: sshd           	0:off	1:off	2:on	3:on	4:on	5:on	6:off
RETURN CODE: 0
PASS
COMMAND:  /etc/init.d/sshd status | grep running | wc -l
RESULT: 1 
EXPECTED RESULT: 1
RETURN CODE: 0
PASS
######################################################################################
# NEW TEST: ## Verify  chkconfig ... 
######################################################################################
COMMAND:  chkconfig --list | grep crond | cut -f 5
RESULT: 3:on 
EXPECTED RESULT: 3:on
RETURN CODE: 0
PASS
COMMAND:  chkconfig --list | grep  iptables | cut -f 5
RESULT: 3:on 
EXPECTED RESULT: 3:on
RETURN CODE: 0
PASS
######################################################################################
# NEW TEST: ## Verify rsyslog is on ... 
######################################################################################
COMMAND:  chkconfig --list | grep rsyslog | cut -f 5
RESULT: 3:on 
EXPECTED RESULT: 3:on
RETURN CODE: 0
PASS
######################################################################################
# NEW TEST: ## Verify rsyslog config ... 
######################################################################################
COMMAND:  md5sum /etc/rsyslog.conf | cut -f 1 -d  " "
RESULT: dd356958ca9c4e779f7fac13dde3c1b5 
EXPECTED RESULT: dd356958ca9c4e779f7fac13dde3c1b5
RETURN CODE: 0
PASS
######################################################################################
# NEW TEST: ## Verify auditd is on ... 
######################################################################################
COMMAND:  /sbin/chkconfig --list auditd | grep 3:on
RESULT: auditd         	0:off	1:off	2:on	3:on	4:on	5:on	6:off 
EXPECTED RESULT: 
RETURN CODE: 0
PASS
COMMAND:  /sbin/chkconfig --list auditd | grep 5:on
RESULT: auditd         	0:off	1:off	2:on	3:on	4:on	5:on	6:off 
EXPECTED RESULT: 
RETURN CODE: 0
PASS
######################################################################################
# NEW TEST: ## Verify audit.rules ... 
######################################################################################
COMMAND:  md5sum /etc/audit/audit.rules | cut -f 1 -d  " "
RESULT: f9869e1191838c461f5b9051c78a638d 
EXPECTED RESULT: f9869e1191838c461f5b9051c78a638d
RETURN CODE: 0
PASS
######################################################################################
# NEW TEST: ## Verify auditd.conf ... 
######################################################################################
COMMAND:  md5sum /etc/audit/auditd.conf | cut -f 1 -d  " "
RESULT: 612ddf28c3916530d47ef56a1b1ed1ed 
EXPECTED RESULT: 612ddf28c3916530d47ef56a1b1ed1ed
RETURN CODE: 0
PASS
######################################################################################
# NEW TEST: ## Verify auditd sysconfig ... 
######################################################################################
COMMAND:  md5sum /etc/sysconfig/auditd | cut -f 1 -d  " "
RESULT: 123beb3a97a32d96eba4f11509e39da2 
EXPECTED RESULT: 123beb3a97a32d96eba4f11509e39da2
RETURN CODE: 0
PASS
######################################################################################
# NEW TEST: ## Verify sshd_config settings ...
######################################################################################
COMMAND:  cat /etc/ssh/sshd_config  | grep  PasswordAuthentication | grep no | wc -l
RESULT: 1 
EXPECTED RESULT: 1
RETURN CODE: 0
PASS
######################################################################################
# NEW TEST: ## Verify /etc/ld.so.conf.d/libc6-xen.conf is not present ... 
######################################################################################
COMMAND:  ls /etc/ld.so.conf.d/libc6-xen.conf
ls: cannot access /etc/ld.so.conf.d/libc6-xen.conf: No such file or directory
RESULT:  
EXPECTED RESULT: 2
RETURN CODE: 2
PASS
######################################################################################
# NEW TEST: ##test menu.lst ... 
######################################################################################
COMMAND:  file /boot/grub/menu.lst  | grep symbolic | wc -l
RESULT: 1 
EXPECTED RESULT: 1
RETURN CODE: 0
PASS
COMMAND:  file /boot/grub/menu.lst  | grep grub.conf | wc -l
RESULT: 1 
EXPECTED RESULT: 1
RETURN CODE: 0
PASS
COMMAND:  cat /boot/grub/grub.conf  | grep "(hd0,0)" | wc -l
RESULT: 0 
EXPECTED RESULT: 0
RETURN CODE: 0
PASS
######################################################################################
# NEW TEST: ## Verify resize2fs ... 
######################################################################################
COMMAND: resize2fs -p /dev/xvde1 15000M
resize2fs 1.41.12 (17-May-2010)
RETURN CODE: 0
COMMAND:  df -h | grep 15G | wc -l 
RESULT: 1 
EXPECTED RESULT: 1
RETURN CODE: 0
PASS
######################################################################################
# NEW TEST: Fetching Host Details 
######################################################################################
This Host => ec2-50-18-0-237.us-west-1.compute.amazonaws.com with Image Id : ami-03f3ae46, is launched with Instance Id : i-7b924a3c , Instance Type : m1.small and Arch : i386 in the Region : us-west-1b
This is a Hourly image
The Validate Signature is : ZVVL820PhRMOWImQL30tXB0dJaNUHVHXgeZmpJLdZzSiu5qSHCcDxXLLjIXBg5ppVtQXFUc9wru/
STt7Dj+Rt+ujP5Y2LrPp3dMKDEVM6eLyvAeDJ3WUIhpB0CpQPeC6X1AGSTpzAhDMUMvsl5g0F0mu
MrgX634pXr1eufbDESc=

## Summary ##
FAILURES = 3
FAILED TESTS = ## Verify turning on/off swap file ... ## Verify swap size ... ## Verify RPMs ...
LOG FILE = /root/valid/src/validate.log
## Summary ##

######################################################################################
# NEW TEST: ## Open a bugzilla
######################################################################################

Comment 7 Kedar Bidarkar 2011-09-19 15:02:14 UTC
IMAGE ID= ami-03f3ae46_us-west-1_c1.medium
###### TEST KERNEL AFTER REBOOT ####  
######################################################################################
# NEW TEST: ## Verify disabled yum plugin ... 
######################################################################################
COMMAND:  grep ^enabled /etc/yum/pluginconf.d/rhnplugin.conf | grep -v '^#' | cut -d\= -f2 | awk '{print }' | sort -f | uniq
RESULT:  0 
EXPECTED RESULT: 
RETURN CODE: 0
PASS
######################################################################################
# NEW TEST: ## Verify kernel name ... 
######################################################################################
COMMAND:  /bin/uname -s
RESULT: Linux 
EXPECTED RESULT: Linux
RETURN CODE: 0
PASS
######################################################################################
# NEW TEST: ## Verify latest installed kernel is running ... 
######################################################################################
RHEL VERSION IS 6
LATEST_RPM_KERNEL_VERSION=rpm -q kernel --last | head -n 1 |  cut -c 8-60 | cut -d ' ' -f 1
CURRENT_UNAME_KERNAL_VERSION=2.6.32-131.12.1.el6
assert latest rpm kernel = uname -r
COMMAND:  uname -r | sed  's/\(.*\)...../\1/'
RESULT: 2.6.32-131.12.1.el6 
EXPECTED RESULT: 2.6.32-131.12.1.el6
RETURN CODE: 0
PASS
######################################################################################
# NEW TEST: ## Verify latest kenerl is in /boot/grub/menu.1st ... 
######################################################################################
COMMAND:  cat /boot/grub/menu.lst | grep 2.6.32-131.12.1.el6
RESULT: title RHEL-6.1-Starter-EBS-i386-6 (2.6.32-131.12.1.el6.i686)
        kernel /boot/vmlinuz-2.6.32-131.12.1.el6.i686 ro root=LABEL=_/ 
        initrd /boot/initramfs-2.6.32-131.12.1.el6.i686.img 
EXPECTED RESULT: 
RETURN CODE: 0
PASS
######################################################################################
# NEW TEST: ## Verify operating system ... 
######################################################################################
COMMAND:  /bin/uname -o
RESULT: GNU/Linux 
EXPECTED RESULT: GNU/Linux
RETURN CODE: 0
PASS
######################################################################################
# NEW TEST: ## Verify /etc/sysconfig/kernel ... 
######################################################################################
COMMAND:  ls /etc/sysconfig/kernel
RESULT: /etc/sysconfig/kernel 
EXPECTED RESULT: 
RETURN CODE: 0
PASS
######################################################################################
# NEW TEST: ## Verify /etc/sysconfig/kernel contains UPDATEDEFAULT ... 
######################################################################################
COMMAND:  cat /etc/sysconfig/kernel | grep UPDATEDEFAULT=yes
RESULT: UPDATEDEFAULT=yes 
EXPECTED RESULT: 
RETURN CODE: 0
PASS
######################################################################################
# NEW TEST: ## Verify /etc/sysconfig/kernel contains DEFAULTKERNEL ... 
######################################################################################
COMMAND:  cat /etc/sysconfig/kernel | grep DEFAULTKERNEL=kernel
RESULT: DEFAULTKERNEL=kernel 
EXPECTED RESULT: 
RETURN CODE: 0
PASS
######################################################################################
# NEW TEST: ##Verify memory match hwp ... 
######################################################################################
cat /proc/meminfo | grep MemTotal: | awk '{print }'
FOUND MEMORY OF 1753112 > hwp MEMORY of 1700000
COMMAND:  echo true
RESULT: true 
EXPECTED RESULT: 
RETURN CODE: 0
PASS
######################################################################################
# NEW TEST: Fetching Host Details 
######################################################################################
This Host =>  with Image Id : ami-03f3ae46, is launched with Instance Id : i-6d924a2a , Instance Type : c1.medium and Arch : i386 in the Region : us-west-1b
This is a Hourly image
The Validate Signature is : aoNS/97b7EM4KzwdZuyJUZpBBJcSfKNZMEetwKkPKljHEqJjeYWrU73MWZj0Yf/LCuC7lfmKxAt8
B9zw1MaZ62tV+6GrFM4ZmwXIXPTyIpUUVd8QdVnLrBCAthYofYZKlzcCNq7w4qOUY1ScZYD8g7SJ
U+J5SekhmmT05lhP3JM=
hostname
######################################################################################
# NEW TEST: The selected image has the version RHEL 6.1
######################################################################################

## Summary ##
FAILURES = 3
FAILED TESTS = ## Verify turning on/off swap file ... ## Verify swap size ... ## Verify RPMs ...
LOG FILE = /root/valid/src/validate.log
## Summary ##

######################################################################################
# NEW TEST: ## Open a bugzilla
######################################################################################

Comment 8 Kedar Bidarkar 2011-09-19 15:02:18 UTC
RESULT: Loaded plugins: amazon-id, rhui-lb, security
Setting up Group Process
Package gcc-4.4.5-6.el6.i686 already installed and latest version
Package 1:make-3.81-19.el6.i686 already installed and latest version
Package patch-2.6-6.el6.i686 already installed and latest version
Package 1:pkgconfig-0.23-9.1.el6.i686 already installed and latest version
Package gettext-0.17-16.el6.i686 already installed and latest version
Package binutils-2.20.51.0.2-5.20.el6_1.1.i686 already installed and latest version
Package elfutils-0.152-1.el6.i686 already installed and latest version
Package cvs-1.11.23-11.el6_0.1.i686 already installed and latest version
Package subversion-1.6.11-2.el6_1.4.i686 already installed and latest version
Resolving Dependencies
--> Running transaction check
---> Package autoconf.noarch 0:2.63-5.1.el6 will be installed
---> Package automake.noarch 0:1.11.1-1.2.el6 will be installed
---> Package bison.i686 0:2.4.1-5.el6 will be installed
---> Package byacc.i686 0:1.9.20070509-6.1.el6 will be installed
---> Package cscope.i686 0:15.6-6.el6 will be installed
---> Package ctags.i686 0:5.8-2.el6 will be installed
---> Package diffstat.i686 0:1.51-2.el6 will be installed
---> Package doxygen.i686 1:1.6.1-4.el6 will be installed
---> Package flex.i686 0:2.5.35-8.el6 will be installed
---> Package gcc-c++.i686 0:4.4.5-6.el6 will be installed
--> Processing Dependency: libstdc++-devel = 4.4.5-6.el6 for package: gcc-c++-4.4.5-6.el6.i686
---> Package gcc-gfortran.i686 0:4.4.5-6.el6 will be installed
---> Package git.i686 0:1.7.1-2.el6_0.1 will be installed
--> Processing Dependency: perl-Git = 1.7.1-2.el6_0.1 for package: git-1.7.1-2.el6_0.1.i686
--> Processing Dependency: perl(Error) for package: git-1.7.1-2.el6_0.1.i686
--> Processing Dependency: perl(Git) for package: git-1.7.1-2.el6_0.1.i686
---> Package indent.i686 0:2.2.10-5.1.el6 will be installed
---> Package intltool.noarch 0:0.41.0-1.1.el6 will be installed
--> Processing Dependency: gettext-devel for package: intltool-0.41.0-1.1.el6.noarch
---> Package libtool.i686 0:2.2.6-15.5.el6 will be installed
---> Package patchutils.i686 0:0.3.1-3.1.el6 will be installed
---> Package rcs.i686 0:5.7-37.el6 will be installed
---> Package redhat-rpm-config.noarch 0:9.0.3-33.el6 will be installed
---> Package rpm-build.i686 0:4.8.0-16.el6 will be installed
---> Package swig.i686 0:1.3.40-5.el6 will be installed
---> Package systemtap.i686 0:1.4-6.el6_1.3 will be installed
--> Running transaction check
---> Package gettext-devel.i686 0:0.17-16.el6 will be installed
--> Processing Dependency: gettext-libs = 0.17-16.el6 for package: gettext-devel-0.17-16.el6.i686
--> Processing Dependency: libasprintf.so.0 for package: gettext-devel-0.17-16.el6.i686
--> Processing Dependency: libgettextpo.so.0 for package: gettext-devel-0.17-16.el6.i686
---> Package libstdc++-devel.i686 0:4.4.5-6.el6 will be installed
---> Package perl-Error.noarch 1:0.17015-4.el6 will be installed
---> Package perl-Git.noarch 0:1.7.1-2.el6_0.1 will be installed
--> Running transaction check
---> Package gettext-libs.i686 0:0.17-16.el6 will be installed
--> Finished Dependency Resolution

Dependencies Resolved

================================================================================
 Package         Arch   Version         Repository                         Size
================================================================================
Installing:
 autoconf        noarch 2.63-5.1.el6    rhui-us-west-rhel-server-releases 781 k
 automake        noarch 1.11.1-1.2.el6  rhui-us-west-rhel-server-releases 550 k
 bison           i686   2.4.1-5.el6     rhui-us-west-rhel-server-releases 626 k
 byacc           i686   1.9.20070509-6.1.el6
                                        rhui-us-west-rhel-server-releases  44 k
 cscope          i686   15.6-6.el6      rhui-us-west-rhel-server-releases 130 k
 ctags           i686   5.8-2.el6       rhui-us-west-rhel-server-releases 142 k
 diffstat        i686   1.51-2.el6      rhui-us-west-rhel-server-releases  29 k
 doxygen         i686   1:1.6.1-4.el6   rhui-us-west-rhel-server-releases 2.3 M
 flex            i686   2.5.35-8.el6    rhui-us-west-rhel-server-releases 279 k
 gcc-c++         i686   4.4.5-6.el6     rhui-us-west-rhel-server-releases 4.3 M
 gcc-gfortran    i686   4.4.5-6.el6     rhui-us-west-rhel-server-releases 4.1 M
 git             i686   1.7.1-2.el6_0.1 rhui-us-west-rhel-server-releases 4.5 M
 indent          i686   2.2.10-5.1.el6  rhui-us-west-rhel-server-releases 111 k
 intltool        noarch 0.41.0-1.1.el6  rhui-us-west-rhel-server-releases  58 k
 libtool         i686   2.2.6-15.5.el6  rhui-us-west-rhel-server-releases 564 k
 patchutils      i686   0.3.1-3.1.el6   rhui-us-west-rhel-server-releases  94 k
 rcs             i686   5.7-37.el6      rhui-us-west-rhel-server-releases 169 k
 redhat-rpm-config
                 noarch 9.0.3-33.el6    rhui-us-west-rhel-server-releases  57 k
 rpm-build       i686   4.8.0-16.el6    rhui-us-west-rhel-server-releases 124 k
 swig            i686   1.3.40-5.el6    rhui-us-west-rhel-server-releases 1.1 M
 systemtap       i686   1.4-6.el6_1.3   rhui-us-west-rhel-server-releases 2.8 M
Installing for dependencies:
 gettext-devel   i686   0.17-16.el6     rhui-us-west-rhel-server-releases 153 k
 gettext-libs    i686   0.17-16.el6     rhui-us-west-rhel-server-releases 110 k
 libstdc++-devel i686   4.4.5-6.el6     rhui-us-west-rhel-server-releases 1.5 M
 perl-Error      noarch 1:0.17015-4.el6 rhui-us-west-rhel-server-releases  29 k
 perl-Git        noarch 1.7.1-2.el6_0.1 rhui-us-west-rhel-server-releases  28 k

Transaction Summary
================================================================================
Install      26 Package(s)

Total download size: 25 M
Installed size: 25 M
Downloading Packages:
--------------------------------------------------------------------------------
Total                                           3.1 MB/s |  25 MB     00:07     
Running rpm_check_debug
Running Transaction Test
Transaction Test Succeeded
Running Transaction

  Installing : 1:perl-Error-0.17015-4.el6.noarch                           1/26 

  Installing : autoconf-2.63-5.1.el6.noarch                                2/26 

  Installing : automake-1.11.1-1.2.el6.noarch                              3/26 

  Installing : git-1.7.1-2.el6_0.1.i686                                    4/26 

  Installing : perl-Git-1.7.1-2.el6_0.1.noarch                             5/26 

  Installing : libstdc++-devel-4.4.5-6.el6.i686                            6/26 

  Installing : libtool-2.2.6-15.5.el6.i686                                 7/26 

  Installing : redhat-rpm-config-9.0.3-33.el6.noarch                       8/26 

  Installing : gettext-libs-0.17-16.el6.i686                               9/26 

  Installing : gettext-devel-0.17-16.el6.i686                             10/26 

  Installing : intltool-0.41.0-1.1.el6.noarch                             11/26 

  Installing : gcc-c++-4.4.5-6.el6.i686                                   12/26 

  Installing : rcs-5.7-37.el6.i686                                        13/26 

  Installing : cscope-15.6-6.el6.i686                                     14/26 

  Installing : indent-2.2.10-5.1.el6.i686                                 15/26 

  Installing : swig-1.3.40-5.el6.i686                                     16/26 

  Installing : patchutils-0.3.1-3.1.el6.i686                              17/26 

  Installing : bison-2.4.1-5.el6.i686                                     18/26 

  Installing : ctags-5.8-2.el6.i686                                       19/26 

  Installing : byacc-1.9.20070509-6.1.el6.i686                            20/26 

  Installing : rpm-build-4.8.0-16.el6.i686                                21/26 

  Installing : 1:doxygen-1.6.1-4.el6.i686                                 22/26 

  Installing : diffstat-1.51-2.el6.i686                                   23/26 

  Installing : gcc-gfortran-4.4.5-6.el6.i686                              24/26 

  Installing : flex-2.5.35-8.el6.i686                                     25/26 

  Installing : systemtap-1.4-6.el6_1.3.i686                               26/26 

Installed:
  autoconf.noarch 0:2.63-5.1.el6     automake.noarch 0:1.11.1-1.2.el6          
  bison.i686 0:2.4.1-5.el6           byacc.i686 0:1.9.20070509-6.1.el6         
  cscope.i686 0:15.6-6.el6           ctags.i686 0:5.8-2.el6                    
  diffstat.i686 0:1.51-2.el6         doxygen.i686 1:1.6.1-4.el6                
  flex.i686 0:2.5.35-8.el6           gcc-c++.i686 0:4.4.5-6.el6                
  gcc-gfortran.i686 0:4.4.5-6.el6    git.i686 0:1.7.1-2.el6_0.1                
  indent.i686 0:2.2.10-5.1.el6       intltool.noarch 0:0.41.0-1.1.el6          
  libtool.i686 0:2.2.6-15.5.el6      patchutils.i686 0:0.3.1-3.1.el6           
  rcs.i686 0:5.7-37.el6              redhat-rpm-config.noarch 0:9.0.3-33.el6   
  rpm-build.i686 0:4.8.0-16.el6      swig.i686 0:1.3.40-5.el6                  
  systemtap.i686 0:1.4-6.el6_1.3    

Dependency Installed:
  gettext-devel.i686 0:0.17-16.el6        gettext-libs.i686 0:0.17-16.el6       
  libstdc++-devel.i686 0:4.4.5-6.el6      perl-Error.noarch 1:0.17015-4.el6     
  perl-Git.noarch 0:1.7.1-2.el6_0.1      

Complete! 
EXPECTED RESULT: 
RETURN CODE: 0
PASS
######################################################################################
# NEW TEST: ## Verify yum update ... 
######################################################################################
COMMAND:  /usr/bin/yum -y update
RESULT: Loaded plugins: amazon-id, rhui-lb, security
Setting up Update Process
No Packages marked for Update 
EXPECTED RESULT: 
RETURN CODE: 0
PASS
######################################################################################
# NEW TEST: ## Verify no fa1lures in rpm package ... 
######################################################################################
COMMAND:  cat /root/valid/src/validate.log | grep 'failure in rpm package' | wc -l
RESULT: 1 
EXPECTED RESULT: 1
RETURN CODE: 0
PASS
######################################################################################
# NEW TEST: ## Verify no rpm scriplet fa1lures ... 
######################################################################################
COMMAND:  cat /root/valid/src/validate.log | grep 'scriptlet failed, exit status 1' | wc -l
RESULT: 1 
EXPECTED RESULT: 1
RETURN CODE: 0
PASS
######################################################################################
# NEW TEST: ## Verify package removal... 
######################################################################################
COMMAND: /bin/rpm -e zsh
RETURN CODE: 0
COMMAND:  /bin/rpm -q zsh
RESULT: package zsh is not installed 
EXPECTED RESULT: package zsh is not installed
RETURN CODE: 1
PASS
######################################################################################
# NEW TEST: ## Verify bash_history ... 
######################################################################################
COMMAND:  cat ~/.bash_history | wc -l 
cat: /root/.bash_history: No such file or directory
RESULT: 0 
EXPECTED RESULT: 0
RETURN CODE: 0
PASS
######################################################################################
# NEW TEST: ## Verify no systemid file ... 
######################################################################################
COMMAND:  echo true
RESULT: true 
EXPECTED RESULT: 
RETURN CODE: 0
PASS
######################################################################################
# NEW TEST: ## Verify rh-cloud-firstboot is OFF ... 
######################################################################################
COMMAND:  chkconfig --list | grep rh-cloud | grep 3:off | wc -l
RESULT: 1 
EXPECTED RESULT: 1
RETURN CODE: 0
PASS
/etc/sysconfig/rh-cloud-firstboot FOUND
COMMAND:  echo true
RESULT: true 
EXPECTED RESULT: 
RETURN CODE: 0
PASS
COMMAND:  cat /etc/sysconfig/rh-cloud-firstboot
RESULT: RUN_FIRSTBOOT=NO 
EXPECTED RESULT: RUN_FIRSTBOOT=NO
RETURN CODE: 0
PASS
######################################################################################
# NEW TEST: ## Verify nameserver ... 
######################################################################################
COMMAND:  /usr/bin/dig clock.redhat.com 2>> /root/valid/src/validate.log | grep 66.187.233.4  | wc -l
RESULT: 1 
EXPECTED RESULT: 
RETURN CODE: 0
PASS
######################################################################################
# NEW TEST: ## Verify group file ... 
######################################################################################
COMMAND:  cat /etc/group | grep root:x:0
RESULT: root:x:0:root 
EXPECTED RESULT: root:x:0:root
RETURN CODE: 0
PASS
COMMAND:  cat /etc/group | grep bin:x:1
RESULT: bin:x:1:root,bin,daemon 
EXPECTED RESULT: bin:x:1:root,bin,daemon
RETURN CODE: 0
PASS
COMMAND:  cat /etc/group | grep daemon:x:2
RESULT: daemon:x:2:root,bin,daemon 
EXPECTED RESULT: daemon:x:2:root,bin,daemon
RETURN CODE: 0
PASS
COMMAND:  cat /etc/group | grep nobody:x:99
RESULT: nobody:x:99: 
EXPECTED RESULT: nobody:x:99:
RETURN CODE: 0
PASS
######################################################################################
# NEW TEST: ## Verify new passwd file ... 
######################################################################################
COMMAND:  cat /etc/passwd | grep root:x:0
RESULT: root:x:0:0:root:/root:/bin/bash 
EXPECTED RESULT: root:x:0:0:root:/root:/bin/bash
RETURN CODE: 0
PASS
COMMAND:  cat /etc/passwd | grep nobody:x:99
RESULT: nobody:x:99:99:Nobody:/:/sbin/nologin 
EXPECTED RESULT: nobody:x:99:99:Nobody:/:/sbin/nologin
RETURN CODE: 0
PASS
COMMAND:  cat /etc/passwd | grep sshd
RESULT: sshd:x:74:74:Privilege-separated SSH:/var/empty/sshd:/sbin/nologin 
EXPECTED RESULT: sshd:x:74:74:Privilege-separated SSH:/var/empty/sshd:/sbin/nologin
RETURN CODE: 0
PASS
######################################################################################
# NEW TEST: ## Verify runlevel ... 
######################################################################################
COMMAND:  cat /etc/inittab | grep id:
RESULT: id:3:initdefault: 
EXPECTED RESULT: id:3:initdefault:
RETURN CODE: 0
PASS
######################################################################################
# NEW TEST: ## Verify new shells file ... 
######################################################################################
COMMAND:  cat /etc/shells | grep bash
RESULT: /bin/bash 
EXPECTED RESULT: /bin/bash
RETURN CODE: 0
PASS
COMMAND:  cat /etc/shells | grep nologin
RESULT: /sbin/nologin 
EXPECTED RESULT: /sbin/nologin
RETURN CODE: 0
PASS
######################################################################################
# NEW TEST: ## Verify networking ... 
######################################################################################
COMMAND:  grep ^NETWORKING= /etc/sysconfig/network | cut -d\= -f2
RESULT: yes 
EXPECTED RESULT: yes
RETURN CODE: 0
PASS
######################################################################################
# NEW TEST: ## Verify device ... 
######################################################################################
COMMAND:  grep ^DEVICE= /etc/sysconfig/network-scripts/ifcfg-eth0 | cut -d\= -f2
RESULT: eth0 
EXPECTED RESULT: eth0
RETURN CODE: 0
PASS
######################################################################################
# NEW TEST: ## Verify iptables ... 
######################################################################################
COMMAND: /etc/init.d/iptables status | grep REJECT 
5    REJECT     all  --  0.0.0.0/0            0.0.0.0/0           reject-with icmp-host-prohibited 
1    REJECT     all  --  0.0.0.0/0            0.0.0.0/0           reject-with icmp-host-prohibited 
RETURN CODE: 0
COMMAND:  /etc/init.d/iptables status | grep :22 | grep ACCEPT | wc -l 
RESULT: 1 
EXPECTED RESULT: 1
RETURN CODE: 0
PASS
######################################################################################
# NEW TEST: ## Verify sshd ...
######################################################################################
COMMAND:  chkconfig --list | grep sshd
RESULT: sshd           	0:off	1:off	2:on	3:on	4:on	5:on	6:off 
EXPECTED RESULT: sshd           	0:off	1:off	2:on	3:on	4:on	5:on	6:off
RETURN CODE: 0
PASS
COMMAND:  /etc/init.d/sshd status | grep running | wc -l
RESULT: 1 
EXPECTED RESULT: 1
RETURN CODE: 0
PASS
######################################################################################
# NEW TEST: ## Verify  chkconfig ... 
######################################################################################
COMMAND:  chkconfig --list | grep crond | cut -f 5
RESULT: 3:on 
EXPECTED RESULT: 3:on
RETURN CODE: 0
PASS
COMMAND:  chkconfig --list | grep  iptables | cut -f 5
RESULT: 3:on 
EXPECTED RESULT: 3:on
RETURN CODE: 0
PASS
######################################################################################
# NEW TEST: ## Verify rsyslog is on ... 
######################################################################################
COMMAND:  chkconfig --list | grep rsyslog | cut -f 5
RESULT: 3:on 
EXPECTED RESULT: 3:on
RETURN CODE: 0
PASS
######################################################################################
# NEW TEST: ## Verify rsyslog config ... 
######################################################################################
COMMAND:  md5sum /etc/rsyslog.conf | cut -f 1 -d  " "
RESULT: dd356958ca9c4e779f7fac13dde3c1b5 
EXPECTED RESULT: dd356958ca9c4e779f7fac13dde3c1b5
RETURN CODE: 0
PASS
######################################################################################
# NEW TEST: ## Verify auditd is on ... 
######################################################################################
COMMAND:  /sbin/chkconfig --list auditd | grep 3:on
RESULT: auditd         	0:off	1:off	2:on	3:on	4:on	5:on	6:off 
EXPECTED RESULT: 
RETURN CODE: 0
PASS
COMMAND:  /sbin/chkconfig --list auditd | grep 5:on
RESULT: auditd         	0:off	1:off	2:on	3:on	4:on	5:on	6:off 
EXPECTED RESULT: 
RETURN CODE: 0
PASS
######################################################################################
# NEW TEST: ## Verify audit.rules ... 
######################################################################################
COMMAND:  md5sum /etc/audit/audit.rules | cut -f 1 -d  " "
RESULT: f9869e1191838c461f5b9051c78a638d 
EXPECTED RESULT: f9869e1191838c461f5b9051c78a638d
RETURN CODE: 0
PASS
######################################################################################
# NEW TEST: ## Verify auditd.conf ... 
######################################################################################
COMMAND:  md5sum /etc/audit/auditd.conf | cut -f 1 -d  " "
RESULT: 612ddf28c3916530d47ef56a1b1ed1ed 
EXPECTED RESULT: 612ddf28c3916530d47ef56a1b1ed1ed
RETURN CODE: 0
PASS
######################################################################################
# NEW TEST: ## Verify auditd sysconfig ... 
######################################################################################
COMMAND:  md5sum /etc/sysconfig/auditd | cut -f 1 -d  " "
RESULT: 123beb3a97a32d96eba4f11509e39da2 
EXPECTED RESULT: 123beb3a97a32d96eba4f11509e39da2
RETURN CODE: 0
PASS
######################################################################################
# NEW TEST: ## Verify sshd_config settings ...
######################################################################################
COMMAND:  cat /etc/ssh/sshd_config  | grep  PasswordAuthentication | grep no | wc -l
RESULT: 1 
EXPECTED RESULT: 1
RETURN CODE: 0
PASS
######################################################################################
# NEW TEST: ## Verify /etc/ld.so.conf.d/libc6-xen.conf is not present ... 
######################################################################################
COMMAND:  ls /etc/ld.so.conf.d/libc6-xen.conf
ls: cannot access /etc/ld.so.conf.d/libc6-xen.conf: No such file or directory
RESULT:  
EXPECTED RESULT: 2
RETURN CODE: 2
PASS
######################################################################################
# NEW TEST: ##test menu.lst ... 
######################################################################################
COMMAND:  file /boot/grub/menu.lst  | grep symbolic | wc -l
RESULT: 1 
EXPECTED RESULT: 1
RETURN CODE: 0
PASS
COMMAND:  file /boot/grub/menu.lst  | grep grub.conf | wc -l
RESULT: 1 
EXPECTED RESULT: 1
RETURN CODE: 0
PASS
COMMAND:  cat /boot/grub/grub.conf  | grep "(hd0,0)" | wc -l
RESULT: 0 
EXPECTED RESULT: 0
RETURN CODE: 0
PASS
######################################################################################
# NEW TEST: ## Verify resize2fs ... 
######################################################################################
COMMAND: resize2fs -p /dev/xvde1 15000M
resize2fs 1.41.12 (17-May-2010)
RETURN CODE: 0
COMMAND:  df -h | grep 15G | wc -l 
RESULT: 1 
EXPECTED RESULT: 1
RETURN CODE: 0
PASS
######################################################################################
# NEW TEST: Fetching Host Details 
######################################################################################
This Host => ec2-204-236-152-39.us-west-1.compute.amazonaws.com with Image Id : ami-03f3ae46, is launched with Instance Id : i-6d924a2a , Instance Type : c1.medium and Arch : i386 in the Region : us-west-1b
This is a Hourly image
The Validate Signature is : aoNS/97b7EM4KzwdZuyJUZpBBJcSfKNZMEetwKkPKljHEqJjeYWrU73MWZj0Yf/LCuC7lfmKxAt8
B9zw1MaZ62tV+6GrFM4ZmwXIXPTyIpUUVd8QdVnLrBCAthYofYZKlzcCNq7w4qOUY1ScZYD8g7SJ
U+J5SekhmmT05lhP3JM=

## Summary ##
FAILURES = 3
FAILED TESTS = ## Verify turning on/off swap file ... ## Verify swap size ... ## Verify RPMs ...
LOG FILE = /root/valid/src/validate.log
## Summary ##

######################################################################################
# NEW TEST: ## Open a bugzilla
######################################################################################

Comment 9 Kedar Bidarkar 2011-09-19 15:05:45 UTC
IMAGE ID= ami-03f3ae46_us-west-1_t1.micro
###### TEST KERNEL AFTER REBOOT ####  
######################################################################################
# NEW TEST: ## Verify disabled yum plugin ... 
######################################################################################
COMMAND:  grep ^enabled /etc/yum/pluginconf.d/rhnplugin.conf | grep -v '^#' | cut -d\= -f2 | awk '{print }' | sort -f | uniq
RESULT:  0 
EXPECTED RESULT: 
RETURN CODE: 0
PASS
######################################################################################
# NEW TEST: ## Verify kernel name ... 
######################################################################################
COMMAND:  /bin/uname -s
RESULT: Linux 
EXPECTED RESULT: Linux
RETURN CODE: 0
PASS
######################################################################################
# NEW TEST: ## Verify latest installed kernel is running ... 
######################################################################################
RHEL VERSION IS 6
LATEST_RPM_KERNEL_VERSION=rpm -q kernel --last | head -n 1 |  cut -c 8-60 | cut -d ' ' -f 1
CURRENT_UNAME_KERNAL_VERSION=2.6.32-131.12.1.el6
assert latest rpm kernel = uname -r
COMMAND:  uname -r | sed  's/\(.*\)...../\1/'
RESULT: 2.6.32-131.12.1.el6 
EXPECTED RESULT: 2.6.32-131.12.1.el6
RETURN CODE: 0
PASS
######################################################################################
# NEW TEST: ## Verify latest kenerl is in /boot/grub/menu.1st ... 
######################################################################################
COMMAND:  cat /boot/grub/menu.lst | grep 2.6.32-131.12.1.el6
RESULT: title RHEL-6.1-Starter-EBS-i386-6 (2.6.32-131.12.1.el6.i686)
        kernel /boot/vmlinuz-2.6.32-131.12.1.el6.i686 ro root=LABEL=_/ 
        initrd /boot/initramfs-2.6.32-131.12.1.el6.i686.img 
EXPECTED RESULT: 
RETURN CODE: 0
PASS
######################################################################################
# NEW TEST: ## Verify operating system ... 
######################################################################################
COMMAND:  /bin/uname -o
RESULT: GNU/Linux 
EXPECTED RESULT: GNU/Linux
RETURN CODE: 0
PASS
######################################################################################
# NEW TEST: ## Verify /etc/sysconfig/kernel ... 
######################################################################################
COMMAND:  ls /etc/sysconfig/kernel
RESULT: /etc/sysconfig/kernel 
EXPECTED RESULT: 
RETURN CODE: 0
PASS
######################################################################################
# NEW TEST: ## Verify /etc/sysconfig/kernel contains UPDATEDEFAULT ... 
######################################################################################
COMMAND:  cat /etc/sysconfig/kernel | grep UPDATEDEFAULT=yes
RESULT: UPDATEDEFAULT=yes 
EXPECTED RESULT: 
RETURN CODE: 0
PASS
######################################################################################
# NEW TEST: ## Verify /etc/sysconfig/kernel contains DEFAULTKERNEL ... 
######################################################################################
COMMAND:  cat /etc/sysconfig/kernel | grep DEFAULTKERNEL=kernel
RESULT: DEFAULTKERNEL=kernel 
EXPECTED RESULT: 
RETURN CODE: 0
PASS
######################################################################################
# NEW TEST: ##Verify memory match hwp ... 
######################################################################################
cat /proc/meminfo | grep MemTotal: | awk '{print }'
FOUND MEMORY OF 610756 > hwp MEMORY of 600000
COMMAND:  echo true
RESULT: true 
EXPECTED RESULT: 
RETURN CODE: 0
PASS
######################################################################################
# NEW TEST: Fetching Host Details 
######################################################################################
This Host =>  with Image Id : ami-03f3ae46, is launched with Instance Id : i-73924a34 , Instance Type : t1.micro and Arch : i386 in the Region : us-west-1c
This is a Hourly image
The Validate Signature is : P7fb5zOAbXcgaPO8DmJQOflHW8wgBQow/7DeBpQbSXwfjrpZVoxG9hZ9eJKjYYTV733HodhknSKj
WbRe1JeUfAfSq6ydzgMeyQ/3DoTHidXrQP6blmTTqYY5g4knsvzy6bJO96VXwWPVG64fhi0FMmrl
lBc1Ih9BfYY2Wa7Cdcc=
hostname
######################################################################################
# NEW TEST: The selected image has the version RHEL 6.1
######################################################################################

## Summary ##
FAILURES = 1
FAILED TESTS = ## Verify RPMs ...
LOG FILE = /root/valid/src/validate.log
## Summary ##

######################################################################################
# NEW TEST: ## Open a bugzilla
######################################################################################

Comment 10 Kedar Bidarkar 2011-09-19 15:05:48 UTC
---> Package doxygen.i686 1:1.6.1-4.el6 will be installed
---> Package flex.i686 0:2.5.35-8.el6 will be installed
---> Package gcc-c++.i686 0:4.4.5-6.el6 will be installed
--> Processing Dependency: libstdc++-devel = 4.4.5-6.el6 for package: gcc-c++-4.4.5-6.el6.i686
---> Package gcc-gfortran.i686 0:4.4.5-6.el6 will be installed
---> Package git.i686 0:1.7.1-2.el6_0.1 will be installed
--> Processing Dependency: perl-Git = 1.7.1-2.el6_0.1 for package: git-1.7.1-2.el6_0.1.i686
--> Processing Dependency: perl(Error) for package: git-1.7.1-2.el6_0.1.i686
--> Processing Dependency: perl(Git) for package: git-1.7.1-2.el6_0.1.i686
---> Package indent.i686 0:2.2.10-5.1.el6 will be installed
---> Package intltool.noarch 0:0.41.0-1.1.el6 will be installed
--> Processing Dependency: gettext-devel for package: intltool-0.41.0-1.1.el6.noarch
---> Package libtool.i686 0:2.2.6-15.5.el6 will be installed
---> Package patchutils.i686 0:0.3.1-3.1.el6 will be installed
---> Package rcs.i686 0:5.7-37.el6 will be installed
---> Package redhat-rpm-config.noarch 0:9.0.3-33.el6 will be installed
---> Package rpm-build.i686 0:4.8.0-16.el6 will be installed
---> Package swig.i686 0:1.3.40-5.el6 will be installed
---> Package systemtap.i686 0:1.4-6.el6_1.3 will be installed
--> Running transaction check
---> Package gettext-devel.i686 0:0.17-16.el6 will be installed
--> Processing Dependency: gettext-libs = 0.17-16.el6 for package: gettext-devel-0.17-16.el6.i686
--> Processing Dependency: libasprintf.so.0 for package: gettext-devel-0.17-16.el6.i686
--> Processing Dependency: libgettextpo.so.0 for package: gettext-devel-0.17-16.el6.i686
---> Package libstdc++-devel.i686 0:4.4.5-6.el6 will be installed
---> Package perl-Error.noarch 1:0.17015-4.el6 will be installed
---> Package perl-Git.noarch 0:1.7.1-2.el6_0.1 will be installed
--> Running transaction check
---> Package gettext-libs.i686 0:0.17-16.el6 will be installed
--> Finished Dependency Resolution

Dependencies Resolved

================================================================================
 Package         Arch   Version         Repository                         Size
================================================================================
Installing:
 autoconf        noarch 2.63-5.1.el6    rhui-us-west-rhel-server-releases 781 k
 automake        noarch 1.11.1-1.2.el6  rhui-us-west-rhel-server-releases 550 k
 bison           i686   2.4.1-5.el6     rhui-us-west-rhel-server-releases 626 k
 byacc           i686   1.9.20070509-6.1.el6
                                        rhui-us-west-rhel-server-releases  44 k
 cscope          i686   15.6-6.el6      rhui-us-west-rhel-server-releases 130 k
 ctags           i686   5.8-2.el6       rhui-us-west-rhel-server-releases 142 k
 diffstat        i686   1.51-2.el6      rhui-us-west-rhel-server-releases  29 k
 doxygen         i686   1:1.6.1-4.el6   rhui-us-west-rhel-server-releases 2.3 M
 flex            i686   2.5.35-8.el6    rhui-us-west-rhel-server-releases 279 k
 gcc-c++         i686   4.4.5-6.el6     rhui-us-west-rhel-server-releases 4.3 M
 gcc-gfortran    i686   4.4.5-6.el6     rhui-us-west-rhel-server-releases 4.1 M
 git             i686   1.7.1-2.el6_0.1 rhui-us-west-rhel-server-releases 4.5 M
 indent          i686   2.2.10-5.1.el6  rhui-us-west-rhel-server-releases 111 k
 intltool        noarch 0.41.0-1.1.el6  rhui-us-west-rhel-server-releases  58 k
 libtool         i686   2.2.6-15.5.el6  rhui-us-west-rhel-server-releases 564 k
 patchutils      i686   0.3.1-3.1.el6   rhui-us-west-rhel-server-releases  94 k
 rcs             i686   5.7-37.el6      rhui-us-west-rhel-server-releases 169 k
 redhat-rpm-config
                 noarch 9.0.3-33.el6    rhui-us-west-rhel-server-releases  57 k
 rpm-build       i686   4.8.0-16.el6    rhui-us-west-rhel-server-releases 124 k
 swig            i686   1.3.40-5.el6    rhui-us-west-rhel-server-releases 1.1 M
 systemtap       i686   1.4-6.el6_1.3   rhui-us-west-rhel-server-releases 2.8 M
Installing for dependencies:
 gettext-devel   i686   0.17-16.el6     rhui-us-west-rhel-server-releases 153 k
 gettext-libs    i686   0.17-16.el6     rhui-us-west-rhel-server-releases 110 k
 libstdc++-devel i686   4.4.5-6.el6     rhui-us-west-rhel-server-releases 1.5 M
 perl-Error      noarch 1:0.17015-4.el6 rhui-us-west-rhel-server-releases  29 k
 perl-Git        noarch 1.7.1-2.el6_0.1 rhui-us-west-rhel-server-releases  28 k

Transaction Summary
================================================================================
Install      26 Package(s)

Total download size: 25 M
Installed size: 25 M
Downloading Packages:
--------------------------------------------------------------------------------
Total                                           4.3 MB/s |  25 MB     00:05     
Running rpm_check_debug
Running Transaction Test
Transaction Test Succeeded
Running Transaction

  Installing : 1:perl-Error-0.17015-4.el6.noarch                           1/26 

  Installing : autoconf-2.63-5.1.el6.noarch                                2/26 

  Installing : automake-1.11.1-1.2.el6.noarch                              3/26 

  Installing : git-1.7.1-2.el6_0.1.i686                                    4/26 

  Installing : perl-Git-1.7.1-2.el6_0.1.noarch                             5/26 

  Installing : libstdc++-devel-4.4.5-6.el6.i686                            6/26 

  Installing : libtool-2.2.6-15.5.el6.i686                                 7/26 

  Installing : redhat-rpm-config-9.0.3-33.el6.noarch                       8/26 

  Installing : gettext-libs-0.17-16.el6.i686                               9/26 

  Installing : gettext-devel-0.17-16.el6.i686                             10/26 

  Installing : intltool-0.41.0-1.1.el6.noarch                             11/26 

  Installing : gcc-c++-4.4.5-6.el6.i686                                   12/26 

  Installing : rcs-5.7-37.el6.i686                                        13/26 

  Installing : cscope-15.6-6.el6.i686                                     14/26 

  Installing : indent-2.2.10-5.1.el6.i686                                 15/26 

  Installing : swig-1.3.40-5.el6.i686                                     16/26 

  Installing : patchutils-0.3.1-3.1.el6.i686                              17/26 

  Installing : bison-2.4.1-5.el6.i686                                     18/26 

  Installing : ctags-5.8-2.el6.i686                                       19/26 

  Installing : byacc-1.9.20070509-6.1.el6.i686                            20/26 

  Installing : rpm-build-4.8.0-16.el6.i686                                21/26 

  Installing : 1:doxygen-1.6.1-4.el6.i686                                 22/26 

  Installing : diffstat-1.51-2.el6.i686                                   23/26 

  Installing : gcc-gfortran-4.4.5-6.el6.i686                              24/26 

  Installing : flex-2.5.35-8.el6.i686                                     25/26 

  Installing : systemtap-1.4-6.el6_1.3.i686                               26/26 

Installed:
  autoconf.noarch 0:2.63-5.1.el6     automake.noarch 0:1.11.1-1.2.el6          
  bison.i686 0:2.4.1-5.el6           byacc.i686 0:1.9.20070509-6.1.el6         
  cscope.i686 0:15.6-6.el6           ctags.i686 0:5.8-2.el6                    
  diffstat.i686 0:1.51-2.el6         doxygen.i686 1:1.6.1-4.el6                
  flex.i686 0:2.5.35-8.el6           gcc-c++.i686 0:4.4.5-6.el6                
  gcc-gfortran.i686 0:4.4.5-6.el6    git.i686 0:1.7.1-2.el6_0.1                
  indent.i686 0:2.2.10-5.1.el6       intltool.noarch 0:0.41.0-1.1.el6          
  libtool.i686 0:2.2.6-15.5.el6      patchutils.i686 0:0.3.1-3.1.el6           
  rcs.i686 0:5.7-37.el6              redhat-rpm-config.noarch 0:9.0.3-33.el6   
  rpm-build.i686 0:4.8.0-16.el6      swig.i686 0:1.3.40-5.el6                  
  systemtap.i686 0:1.4-6.el6_1.3    

Dependency Installed:
  gettext-devel.i686 0:0.17-16.el6        gettext-libs.i686 0:0.17-16.el6       
  libstdc++-devel.i686 0:4.4.5-6.el6      perl-Error.noarch 1:0.17015-4.el6     
  perl-Git.noarch 0:1.7.1-2.el6_0.1      

Complete! 
EXPECTED RESULT: 
RETURN CODE: 0
PASS
######################################################################################
# NEW TEST: ## Verify yum update ... 
######################################################################################
COMMAND:  /usr/bin/yum -y update
RESULT: Loaded plugins: amazon-id, rhui-lb, security
Setting up Update Process
No Packages marked for Update 
EXPECTED RESULT: 
RETURN CODE: 0
PASS
######################################################################################
# NEW TEST: ## Verify no fa1lures in rpm package ... 
######################################################################################
COMMAND:  cat /root/valid/src/validate.log | grep 'failure in rpm package' | wc -l
RESULT: 1 
EXPECTED RESULT: 1
RETURN CODE: 0
PASS
######################################################################################
# NEW TEST: ## Verify no rpm scriplet fa1lures ... 
######################################################################################
COMMAND:  cat /root/valid/src/validate.log | grep 'scriptlet failed, exit status 1' | wc -l
RESULT: 1 
EXPECTED RESULT: 1
RETURN CODE: 0
PASS
######################################################################################
# NEW TEST: ## Verify package removal... 
######################################################################################
COMMAND: /bin/rpm -e zsh
RETURN CODE: 0
COMMAND:  /bin/rpm -q zsh
RESULT: package zsh is not installed 
EXPECTED RESULT: package zsh is not installed
RETURN CODE: 1
PASS
######################################################################################
# NEW TEST: ## Verify bash_history ... 
######################################################################################
COMMAND:  cat ~/.bash_history | wc -l 
cat: /root/.bash_history: No such file or directory
RESULT: 0 
EXPECTED RESULT: 0
RETURN CODE: 0
PASS
######################################################################################
# NEW TEST: ## Verify no systemid file ... 
######################################################################################
COMMAND:  echo true
RESULT: true 
EXPECTED RESULT: 
RETURN CODE: 0
PASS
######################################################################################
# NEW TEST: ## Verify rh-cloud-firstboot is OFF ... 
######################################################################################
COMMAND:  chkconfig --list | grep rh-cloud | grep 3:off | wc -l
RESULT: 1 
EXPECTED RESULT: 1
RETURN CODE: 0
PASS
/etc/sysconfig/rh-cloud-firstboot FOUND
COMMAND:  echo true
RESULT: true 
EXPECTED RESULT: 
RETURN CODE: 0
PASS
COMMAND:  cat /etc/sysconfig/rh-cloud-firstboot
RESULT: RUN_FIRSTBOOT=NO 
EXPECTED RESULT: RUN_FIRSTBOOT=NO
RETURN CODE: 0
PASS
######################################################################################
# NEW TEST: ## Verify nameserver ... 
######################################################################################
COMMAND:  /usr/bin/dig clock.redhat.com 2>> /root/valid/src/validate.log | grep 66.187.233.4  | wc -l
RESULT: 1 
EXPECTED RESULT: 
RETURN CODE: 0
PASS
######################################################################################
# NEW TEST: ## Verify group file ... 
######################################################################################
COMMAND:  cat /etc/group | grep root:x:0
RESULT: root:x:0:root 
EXPECTED RESULT: root:x:0:root
RETURN CODE: 0
PASS
COMMAND:  cat /etc/group | grep bin:x:1
RESULT: bin:x:1:root,bin,daemon 
EXPECTED RESULT: bin:x:1:root,bin,daemon
RETURN CODE: 0
PASS
COMMAND:  cat /etc/group | grep daemon:x:2
RESULT: daemon:x:2:root,bin,daemon 
EXPECTED RESULT: daemon:x:2:root,bin,daemon
RETURN CODE: 0
PASS
COMMAND:  cat /etc/group | grep nobody:x:99
RESULT: nobody:x:99: 
EXPECTED RESULT: nobody:x:99:
RETURN CODE: 0
PASS
######################################################################################
# NEW TEST: ## Verify new passwd file ... 
######################################################################################
COMMAND:  cat /etc/passwd | grep root:x:0
RESULT: root:x:0:0:root:/root:/bin/bash 
EXPECTED RESULT: root:x:0:0:root:/root:/bin/bash
RETURN CODE: 0
PASS
COMMAND:  cat /etc/passwd | grep nobody:x:99
RESULT: nobody:x:99:99:Nobody:/:/sbin/nologin 
EXPECTED RESULT: nobody:x:99:99:Nobody:/:/sbin/nologin
RETURN CODE: 0
PASS
COMMAND:  cat /etc/passwd | grep sshd
RESULT: sshd:x:74:74:Privilege-separated SSH:/var/empty/sshd:/sbin/nologin 
EXPECTED RESULT: sshd:x:74:74:Privilege-separated SSH:/var/empty/sshd:/sbin/nologin
RETURN CODE: 0
PASS
######################################################################################
# NEW TEST: ## Verify runlevel ... 
######################################################################################
COMMAND:  cat /etc/inittab | grep id:
RESULT: id:3:initdefault: 
EXPECTED RESULT: id:3:initdefault:
RETURN CODE: 0
PASS
######################################################################################
# NEW TEST: ## Verify new shells file ... 
######################################################################################
COMMAND:  cat /etc/shells | grep bash
RESULT: /bin/bash 
EXPECTED RESULT: /bin/bash
RETURN CODE: 0
PASS
COMMAND:  cat /etc/shells | grep nologin
RESULT: /sbin/nologin 
EXPECTED RESULT: /sbin/nologin
RETURN CODE: 0
PASS
######################################################################################
# NEW TEST: ## Verify networking ... 
######################################################################################
COMMAND:  grep ^NETWORKING= /etc/sysconfig/network | cut -d\= -f2
RESULT: yes 
EXPECTED RESULT: yes
RETURN CODE: 0
PASS
######################################################################################
# NEW TEST: ## Verify device ... 
######################################################################################
COMMAND:  grep ^DEVICE= /etc/sysconfig/network-scripts/ifcfg-eth0 | cut -d\= -f2
RESULT: eth0 
EXPECTED RESULT: eth0
RETURN CODE: 0
PASS
######################################################################################
# NEW TEST: ## Verify iptables ... 
######################################################################################
COMMAND: /etc/init.d/iptables status | grep REJECT 
5    REJECT     all  --  0.0.0.0/0            0.0.0.0/0           reject-with icmp-host-prohibited 
1    REJECT     all  --  0.0.0.0/0            0.0.0.0/0           reject-with icmp-host-prohibited 
RETURN CODE: 0
COMMAND:  /etc/init.d/iptables status | grep :22 | grep ACCEPT | wc -l 
RESULT: 1 
EXPECTED RESULT: 1
RETURN CODE: 0
PASS
######################################################################################
# NEW TEST: ## Verify sshd ...
######################################################################################
COMMAND:  chkconfig --list | grep sshd
RESULT: sshd           	0:off	1:off	2:on	3:on	4:on	5:on	6:off 
EXPECTED RESULT: sshd           	0:off	1:off	2:on	3:on	4:on	5:on	6:off
RETURN CODE: 0
PASS
COMMAND:  /etc/init.d/sshd status | grep running | wc -l
RESULT: 1 
EXPECTED RESULT: 1
RETURN CODE: 0
PASS
######################################################################################
# NEW TEST: ## Verify  chkconfig ... 
######################################################################################
COMMAND:  chkconfig --list | grep crond | cut -f 5
RESULT: 3:on 
EXPECTED RESULT: 3:on
RETURN CODE: 0
PASS
COMMAND:  chkconfig --list | grep  iptables | cut -f 5
RESULT: 3:on 
EXPECTED RESULT: 3:on
RETURN CODE: 0
PASS
######################################################################################
# NEW TEST: ## Verify rsyslog is on ... 
######################################################################################
COMMAND:  chkconfig --list | grep rsyslog | cut -f 5
RESULT: 3:on 
EXPECTED RESULT: 3:on
RETURN CODE: 0
PASS
######################################################################################
# NEW TEST: ## Verify rsyslog config ... 
######################################################################################
COMMAND:  md5sum /etc/rsyslog.conf | cut -f 1 -d  " "
RESULT: dd356958ca9c4e779f7fac13dde3c1b5 
EXPECTED RESULT: dd356958ca9c4e779f7fac13dde3c1b5
RETURN CODE: 0
PASS
######################################################################################
# NEW TEST: ## Verify auditd is on ... 
######################################################################################
COMMAND:  /sbin/chkconfig --list auditd | grep 3:on
RESULT: auditd         	0:off	1:off	2:on	3:on	4:on	5:on	6:off 
EXPECTED RESULT: 
RETURN CODE: 0
PASS
COMMAND:  /sbin/chkconfig --list auditd | grep 5:on
RESULT: auditd         	0:off	1:off	2:on	3:on	4:on	5:on	6:off 
EXPECTED RESULT: 
RETURN CODE: 0
PASS
######################################################################################
# NEW TEST: ## Verify audit.rules ... 
######################################################################################
COMMAND:  md5sum /etc/audit/audit.rules | cut -f 1 -d  " "
RESULT: f9869e1191838c461f5b9051c78a638d 
EXPECTED RESULT: f9869e1191838c461f5b9051c78a638d
RETURN CODE: 0
PASS
######################################################################################
# NEW TEST: ## Verify auditd.conf ... 
######################################################################################
COMMAND:  md5sum /etc/audit/auditd.conf | cut -f 1 -d  " "
RESULT: 612ddf28c3916530d47ef56a1b1ed1ed 
EXPECTED RESULT: 612ddf28c3916530d47ef56a1b1ed1ed
RETURN CODE: 0
PASS
######################################################################################
# NEW TEST: ## Verify auditd sysconfig ... 
######################################################################################
COMMAND:  md5sum /etc/sysconfig/auditd | cut -f 1 -d  " "
RESULT: 123beb3a97a32d96eba4f11509e39da2 
EXPECTED RESULT: 123beb3a97a32d96eba4f11509e39da2
RETURN CODE: 0
PASS
######################################################################################
# NEW TEST: ## Verify sshd_config settings ...
######################################################################################
COMMAND:  cat /etc/ssh/sshd_config  | grep  PasswordAuthentication | grep no | wc -l
RESULT: 1 
EXPECTED RESULT: 1
RETURN CODE: 0
PASS
######################################################################################
# NEW TEST: ## Verify /etc/ld.so.conf.d/libc6-xen.conf is not present ... 
######################################################################################
COMMAND:  ls /etc/ld.so.conf.d/libc6-xen.conf
ls: cannot access /etc/ld.so.conf.d/libc6-xen.conf: No such file or directory
RESULT:  
EXPECTED RESULT: 2
RETURN CODE: 2
PASS
######################################################################################
# NEW TEST: ##test menu.lst ... 
######################################################################################
COMMAND:  file /boot/grub/menu.lst  | grep symbolic | wc -l
RESULT: 1 
EXPECTED RESULT: 1
RETURN CODE: 0
PASS
COMMAND:  file /boot/grub/menu.lst  | grep grub.conf | wc -l
RESULT: 1 
EXPECTED RESULT: 1
RETURN CODE: 0
PASS
COMMAND:  cat /boot/grub/grub.conf  | grep "(hd0,0)" | wc -l
RESULT: 0 
EXPECTED RESULT: 0
RETURN CODE: 0
PASS
######################################################################################
# NEW TEST: ## Verify resize2fs ... 
######################################################################################
COMMAND: resize2fs -p /dev/xvde1 15000M
resize2fs 1.41.12 (17-May-2010)
RETURN CODE: 0
COMMAND:  df -h | grep 15G | wc -l 
RESULT: 1 
EXPECTED RESULT: 1
RETURN CODE: 0
PASS
######################################################################################
# NEW TEST: Fetching Host Details 
######################################################################################
This Host => ec2-50-18-74-131.us-west-1.compute.amazonaws.com with Image Id : ami-03f3ae46, is launched with Instance Id : i-73924a34 , Instance Type : t1.micro and Arch : i386 in the Region : us-west-1c
This is a Hourly image
The Validate Signature is : P7fb5zOAbXcgaPO8DmJQOflHW8wgBQow/7DeBpQbSXwfjrpZVoxG9hZ9eJKjYYTV733HodhknSKj
WbRe1JeUfAfSq6ydzgMeyQ/3DoTHidXrQP6blmTTqYY5g4knsvzy6bJO96VXwWPVG64fhi0FMmrl
lBc1Ih9BfYY2Wa7Cdcc=

## Summary ##
FAILURES = 1
FAILED TESTS = ## Verify RPMs ...
LOG FILE = /root/valid/src/validate.log
## Summary ##

######################################################################################
# NEW TEST: ## Open a bugzilla
######################################################################################

Comment 11 Kedar Bidarkar 2011-09-19 15:07:17 UTC
IMAGE ID= ami-03f3ae46_us-west-1_m1.small
###### TEST KERNEL AFTER REBOOT ####  
######################################################################################
# NEW TEST: ## Verify disabled yum plugin ... 
######################################################################################
COMMAND:  grep ^enabled /etc/yum/pluginconf.d/rhnplugin.conf | grep -v '^#' | cut -d\= -f2 | awk '{print }' | sort -f | uniq
RESULT:  0 
EXPECTED RESULT: 
RETURN CODE: 0
PASS
######################################################################################
# NEW TEST: ## Verify kernel name ... 
######################################################################################
COMMAND:  /bin/uname -s
RESULT: Linux 
EXPECTED RESULT: Linux
RETURN CODE: 0
PASS
######################################################################################
# NEW TEST: ## Verify latest installed kernel is running ... 
######################################################################################
RHEL VERSION IS 6
LATEST_RPM_KERNEL_VERSION=rpm -q kernel --last | head -n 1 |  cut -c 8-60 | cut -d ' ' -f 1
CURRENT_UNAME_KERNAL_VERSION=2.6.32-131.12.1.el6
assert latest rpm kernel = uname -r
COMMAND:  uname -r | sed  's/\(.*\)...../\1/'
RESULT: 2.6.32-131.12.1.el6 
EXPECTED RESULT: 2.6.32-131.12.1.el6
RETURN CODE: 0
PASS
######################################################################################
# NEW TEST: ## Verify latest kenerl is in /boot/grub/menu.1st ... 
######################################################################################
COMMAND:  cat /boot/grub/menu.lst | grep 2.6.32-131.12.1.el6
RESULT: title RHEL-6.1-Starter-EBS-i386-6 (2.6.32-131.12.1.el6.i686)
        kernel /boot/vmlinuz-2.6.32-131.12.1.el6.i686 ro root=LABEL=_/ 
        initrd /boot/initramfs-2.6.32-131.12.1.el6.i686.img 
EXPECTED RESULT: 
RETURN CODE: 0
PASS
######################################################################################
# NEW TEST: ## Verify operating system ... 
######################################################################################
COMMAND:  /bin/uname -o
RESULT: GNU/Linux 
EXPECTED RESULT: GNU/Linux
RETURN CODE: 0
PASS
######################################################################################
# NEW TEST: ## Verify /etc/sysconfig/kernel ... 
######################################################################################
COMMAND:  ls /etc/sysconfig/kernel
RESULT: /etc/sysconfig/kernel 
EXPECTED RESULT: 
RETURN CODE: 0
PASS
######################################################################################
# NEW TEST: ## Verify /etc/sysconfig/kernel contains UPDATEDEFAULT ... 
######################################################################################
COMMAND:  cat /etc/sysconfig/kernel | grep UPDATEDEFAULT=yes
RESULT: UPDATEDEFAULT=yes 
EXPECTED RESULT: 
RETURN CODE: 0
PASS
######################################################################################
# NEW TEST: ## Verify /etc/sysconfig/kernel contains DEFAULTKERNEL ... 
######################################################################################
COMMAND:  cat /etc/sysconfig/kernel | grep DEFAULTKERNEL=kernel
RESULT: DEFAULTKERNEL=kernel 
EXPECTED RESULT: 
RETURN CODE: 0
PASS
######################################################################################
# NEW TEST: ##Verify memory match hwp ... 
######################################################################################
cat /proc/meminfo | grep MemTotal: | awk '{print }'
FOUND MEMORY OF 1712268 > hwp MEMORY of 1700000
COMMAND:  echo true
RESULT: true 
EXPECTED RESULT: 
RETURN CODE: 0
PASS
######################################################################################
# NEW TEST: Fetching Host Details 
######################################################################################
This Host =>  with Image Id : ami-03f3ae46, is launched with Instance Id : i-7b924a3c , Instance Type : m1.small and Arch : i386 in the Region : us-west-1b
This is a Hourly image
The Validate Signature is : ZVVL820PhRMOWImQL30tXB0dJaNUHVHXgeZmpJLdZzSiu5qSHCcDxXLLjIXBg5ppVtQXFUc9wru/
STt7Dj+Rt+ujP5Y2LrPp3dMKDEVM6eLyvAeDJ3WUIhpB0CpQPeC6X1AGSTpzAhDMUMvsl5g0F0mu
MrgX634pXr1eufbDESc=
hostname
######################################################################################
# NEW TEST: The selected image has the version RHEL 6.1
######################################################################################

## Summary ##
FAILURES = 3
FAILED TESTS = ## Verify turning on/off swap file ... ## Verify swap size ... ## Verify RPMs ...
LOG FILE = /root/valid/src/validate.log
## Summary ##

######################################################################################
# NEW TEST: ## Open a bugzilla
######################################################################################

Comment 12 Kedar Bidarkar 2011-09-19 15:07:20 UTC
RESULT: Loaded plugins: amazon-id, rhui-lb, security
Setting up Group Process
Package gcc-4.4.5-6.el6.i686 already installed and latest version
Package 1:make-3.81-19.el6.i686 already installed and latest version
Package patch-2.6-6.el6.i686 already installed and latest version
Package 1:pkgconfig-0.23-9.1.el6.i686 already installed and latest version
Package gettext-0.17-16.el6.i686 already installed and latest version
Package binutils-2.20.51.0.2-5.20.el6_1.1.i686 already installed and latest version
Package elfutils-0.152-1.el6.i686 already installed and latest version
Package cvs-1.11.23-11.el6_0.1.i686 already installed and latest version
Package subversion-1.6.11-2.el6_1.4.i686 already installed and latest version
Resolving Dependencies
--> Running transaction check
---> Package autoconf.noarch 0:2.63-5.1.el6 will be installed
---> Package automake.noarch 0:1.11.1-1.2.el6 will be installed
---> Package bison.i686 0:2.4.1-5.el6 will be installed
---> Package byacc.i686 0:1.9.20070509-6.1.el6 will be installed
---> Package cscope.i686 0:15.6-6.el6 will be installed
---> Package ctags.i686 0:5.8-2.el6 will be installed
---> Package diffstat.i686 0:1.51-2.el6 will be installed
---> Package doxygen.i686 1:1.6.1-4.el6 will be installed
---> Package flex.i686 0:2.5.35-8.el6 will be installed
---> Package gcc-c++.i686 0:4.4.5-6.el6 will be installed
--> Processing Dependency: libstdc++-devel = 4.4.5-6.el6 for package: gcc-c++-4.4.5-6.el6.i686
---> Package gcc-gfortran.i686 0:4.4.5-6.el6 will be installed
---> Package git.i686 0:1.7.1-2.el6_0.1 will be installed
--> Processing Dependency: perl-Git = 1.7.1-2.el6_0.1 for package: git-1.7.1-2.el6_0.1.i686
--> Processing Dependency: perl(Error) for package: git-1.7.1-2.el6_0.1.i686
--> Processing Dependency: perl(Git) for package: git-1.7.1-2.el6_0.1.i686
---> Package indent.i686 0:2.2.10-5.1.el6 will be installed
---> Package intltool.noarch 0:0.41.0-1.1.el6 will be installed
--> Processing Dependency: gettext-devel for package: intltool-0.41.0-1.1.el6.noarch
---> Package libtool.i686 0:2.2.6-15.5.el6 will be installed
---> Package patchutils.i686 0:0.3.1-3.1.el6 will be installed
---> Package rcs.i686 0:5.7-37.el6 will be installed
---> Package redhat-rpm-config.noarch 0:9.0.3-33.el6 will be installed
---> Package rpm-build.i686 0:4.8.0-16.el6 will be installed
---> Package swig.i686 0:1.3.40-5.el6 will be installed
---> Package systemtap.i686 0:1.4-6.el6_1.3 will be installed
--> Running transaction check
---> Package gettext-devel.i686 0:0.17-16.el6 will be installed
--> Processing Dependency: gettext-libs = 0.17-16.el6 for package: gettext-devel-0.17-16.el6.i686
--> Processing Dependency: libasprintf.so.0 for package: gettext-devel-0.17-16.el6.i686
--> Processing Dependency: libgettextpo.so.0 for package: gettext-devel-0.17-16.el6.i686
---> Package libstdc++-devel.i686 0:4.4.5-6.el6 will be installed
---> Package perl-Error.noarch 1:0.17015-4.el6 will be installed
---> Package perl-Git.noarch 0:1.7.1-2.el6_0.1 will be installed
--> Running transaction check
---> Package gettext-libs.i686 0:0.17-16.el6 will be installed
--> Finished Dependency Resolution

Dependencies Resolved

================================================================================
 Package         Arch   Version         Repository                         Size
================================================================================
Installing:
 autoconf        noarch 2.63-5.1.el6    rhui-us-west-rhel-server-releases 781 k
 automake        noarch 1.11.1-1.2.el6  rhui-us-west-rhel-server-releases 550 k
 bison           i686   2.4.1-5.el6     rhui-us-west-rhel-server-releases 626 k
 byacc           i686   1.9.20070509-6.1.el6
                                        rhui-us-west-rhel-server-releases  44 k
 cscope          i686   15.6-6.el6      rhui-us-west-rhel-server-releases 130 k
 ctags           i686   5.8-2.el6       rhui-us-west-rhel-server-releases 142 k
 diffstat        i686   1.51-2.el6      rhui-us-west-rhel-server-releases  29 k
 doxygen         i686   1:1.6.1-4.el6   rhui-us-west-rhel-server-releases 2.3 M
 flex            i686   2.5.35-8.el6    rhui-us-west-rhel-server-releases 279 k
 gcc-c++         i686   4.4.5-6.el6     rhui-us-west-rhel-server-releases 4.3 M
 gcc-gfortran    i686   4.4.5-6.el6     rhui-us-west-rhel-server-releases 4.1 M
 git             i686   1.7.1-2.el6_0.1 rhui-us-west-rhel-server-releases 4.5 M
 indent          i686   2.2.10-5.1.el6  rhui-us-west-rhel-server-releases 111 k
 intltool        noarch 0.41.0-1.1.el6  rhui-us-west-rhel-server-releases  58 k
 libtool         i686   2.2.6-15.5.el6  rhui-us-west-rhel-server-releases 564 k
 patchutils      i686   0.3.1-3.1.el6   rhui-us-west-rhel-server-releases  94 k
 rcs             i686   5.7-37.el6      rhui-us-west-rhel-server-releases 169 k
 redhat-rpm-config
                 noarch 9.0.3-33.el6    rhui-us-west-rhel-server-releases  57 k
 rpm-build       i686   4.8.0-16.el6    rhui-us-west-rhel-server-releases 124 k
 swig            i686   1.3.40-5.el6    rhui-us-west-rhel-server-releases 1.1 M
 systemtap       i686   1.4-6.el6_1.3   rhui-us-west-rhel-server-releases 2.8 M
Installing for dependencies:
 gettext-devel   i686   0.17-16.el6     rhui-us-west-rhel-server-releases 153 k
 gettext-libs    i686   0.17-16.el6     rhui-us-west-rhel-server-releases 110 k
 libstdc++-devel i686   4.4.5-6.el6     rhui-us-west-rhel-server-releases 1.5 M
 perl-Error      noarch 1:0.17015-4.el6 rhui-us-west-rhel-server-releases  29 k
 perl-Git        noarch 1.7.1-2.el6_0.1 rhui-us-west-rhel-server-releases  28 k

Transaction Summary
================================================================================
Install      26 Package(s)

Total download size: 25 M
Installed size: 25 M
Downloading Packages:
--------------------------------------------------------------------------------
Total                                           4.3 MB/s |  25 MB     00:05     
Running rpm_check_debug
Running Transaction Test
Transaction Test Succeeded
Running Transaction

  Installing : 1:perl-Error-0.17015-4.el6.noarch                           1/26 

  Installing : autoconf-2.63-5.1.el6.noarch                                2/26 

  Installing : automake-1.11.1-1.2.el6.noarch                              3/26 

  Installing : git-1.7.1-2.el6_0.1.i686                                    4/26 

  Installing : perl-Git-1.7.1-2.el6_0.1.noarch                             5/26 

  Installing : libstdc++-devel-4.4.5-6.el6.i686                            6/26 

  Installing : libtool-2.2.6-15.5.el6.i686                                 7/26 

  Installing : redhat-rpm-config-9.0.3-33.el6.noarch                       8/26 

  Installing : gettext-libs-0.17-16.el6.i686                               9/26 

  Installing : gettext-devel-0.17-16.el6.i686                             10/26 

  Installing : intltool-0.41.0-1.1.el6.noarch                             11/26 

  Installing : gcc-c++-4.4.5-6.el6.i686                                   12/26 

  Installing : rcs-5.7-37.el6.i686                                        13/26 

  Installing : cscope-15.6-6.el6.i686                                     14/26 

  Installing : indent-2.2.10-5.1.el6.i686                                 15/26 

  Installing : swig-1.3.40-5.el6.i686                                     16/26 

  Installing : patchutils-0.3.1-3.1.el6.i686                              17/26 

  Installing : bison-2.4.1-5.el6.i686                                     18/26 

  Installing : ctags-5.8-2.el6.i686                                       19/26 

  Installing : byacc-1.9.20070509-6.1.el6.i686                            20/26 

  Installing : rpm-build-4.8.0-16.el6.i686                                21/26 

  Installing : 1:doxygen-1.6.1-4.el6.i686                                 22/26 

  Installing : diffstat-1.51-2.el6.i686                                   23/26 

  Installing : gcc-gfortran-4.4.5-6.el6.i686                              24/26 

  Installing : flex-2.5.35-8.el6.i686                                     25/26 

  Installing : systemtap-1.4-6.el6_1.3.i686                               26/26 

Installed:
  autoconf.noarch 0:2.63-5.1.el6     automake.noarch 0:1.11.1-1.2.el6          
  bison.i686 0:2.4.1-5.el6           byacc.i686 0:1.9.20070509-6.1.el6         
  cscope.i686 0:15.6-6.el6           ctags.i686 0:5.8-2.el6                    
  diffstat.i686 0:1.51-2.el6         doxygen.i686 1:1.6.1-4.el6                
  flex.i686 0:2.5.35-8.el6           gcc-c++.i686 0:4.4.5-6.el6                
  gcc-gfortran.i686 0:4.4.5-6.el6    git.i686 0:1.7.1-2.el6_0.1                
  indent.i686 0:2.2.10-5.1.el6       intltool.noarch 0:0.41.0-1.1.el6          
  libtool.i686 0:2.2.6-15.5.el6      patchutils.i686 0:0.3.1-3.1.el6           
  rcs.i686 0:5.7-37.el6              redhat-rpm-config.noarch 0:9.0.3-33.el6   
  rpm-build.i686 0:4.8.0-16.el6      swig.i686 0:1.3.40-5.el6                  
  systemtap.i686 0:1.4-6.el6_1.3    

Dependency Installed:
  gettext-devel.i686 0:0.17-16.el6        gettext-libs.i686 0:0.17-16.el6       
  libstdc++-devel.i686 0:4.4.5-6.el6      perl-Error.noarch 1:0.17015-4.el6     
  perl-Git.noarch 0:1.7.1-2.el6_0.1      

Complete! 
EXPECTED RESULT: 
RETURN CODE: 0
PASS
######################################################################################
# NEW TEST: ## Verify yum update ... 
######################################################################################
COMMAND:  /usr/bin/yum -y update
RESULT: Loaded plugins: amazon-id, rhui-lb, security
Setting up Update Process
No Packages marked for Update 
EXPECTED RESULT: 
RETURN CODE: 0
PASS
######################################################################################
# NEW TEST: ## Verify no fa1lures in rpm package ... 
######################################################################################
COMMAND:  cat /root/valid/src/validate.log | grep 'failure in rpm package' | wc -l
RESULT: 1 
EXPECTED RESULT: 1
RETURN CODE: 0
PASS
######################################################################################
# NEW TEST: ## Verify no rpm scriplet fa1lures ... 
######################################################################################
COMMAND:  cat /root/valid/src/validate.log | grep 'scriptlet failed, exit status 1' | wc -l
RESULT: 1 
EXPECTED RESULT: 1
RETURN CODE: 0
PASS
######################################################################################
# NEW TEST: ## Verify package removal... 
######################################################################################
COMMAND: /bin/rpm -e zsh
RETURN CODE: 0
COMMAND:  /bin/rpm -q zsh
RESULT: package zsh is not installed 
EXPECTED RESULT: package zsh is not installed
RETURN CODE: 1
PASS
######################################################################################
# NEW TEST: ## Verify bash_history ... 
######################################################################################
COMMAND:  cat ~/.bash_history | wc -l 
cat: /root/.bash_history: No such file or directory
RESULT: 0 
EXPECTED RESULT: 0
RETURN CODE: 0
PASS
######################################################################################
# NEW TEST: ## Verify no systemid file ... 
######################################################################################
COMMAND:  echo true
RESULT: true 
EXPECTED RESULT: 
RETURN CODE: 0
PASS
######################################################################################
# NEW TEST: ## Verify rh-cloud-firstboot is OFF ... 
######################################################################################
COMMAND:  chkconfig --list | grep rh-cloud | grep 3:off | wc -l
RESULT: 1 
EXPECTED RESULT: 1
RETURN CODE: 0
PASS
/etc/sysconfig/rh-cloud-firstboot FOUND
COMMAND:  echo true
RESULT: true 
EXPECTED RESULT: 
RETURN CODE: 0
PASS
COMMAND:  cat /etc/sysconfig/rh-cloud-firstboot
RESULT: RUN_FIRSTBOOT=NO 
EXPECTED RESULT: RUN_FIRSTBOOT=NO
RETURN CODE: 0
PASS
######################################################################################
# NEW TEST: ## Verify nameserver ... 
######################################################################################
COMMAND:  /usr/bin/dig clock.redhat.com 2>> /root/valid/src/validate.log | grep 66.187.233.4  | wc -l
RESULT: 1 
EXPECTED RESULT: 
RETURN CODE: 0
PASS
######################################################################################
# NEW TEST: ## Verify group file ... 
######################################################################################
COMMAND:  cat /etc/group | grep root:x:0
RESULT: root:x:0:root 
EXPECTED RESULT: root:x:0:root
RETURN CODE: 0
PASS
COMMAND:  cat /etc/group | grep bin:x:1
RESULT: bin:x:1:root,bin,daemon 
EXPECTED RESULT: bin:x:1:root,bin,daemon
RETURN CODE: 0
PASS
COMMAND:  cat /etc/group | grep daemon:x:2
RESULT: daemon:x:2:root,bin,daemon 
EXPECTED RESULT: daemon:x:2:root,bin,daemon
RETURN CODE: 0
PASS
COMMAND:  cat /etc/group | grep nobody:x:99
RESULT: nobody:x:99: 
EXPECTED RESULT: nobody:x:99:
RETURN CODE: 0
PASS
######################################################################################
# NEW TEST: ## Verify new passwd file ... 
######################################################################################
COMMAND:  cat /etc/passwd | grep root:x:0
RESULT: root:x:0:0:root:/root:/bin/bash 
EXPECTED RESULT: root:x:0:0:root:/root:/bin/bash
RETURN CODE: 0
PASS
COMMAND:  cat /etc/passwd | grep nobody:x:99
RESULT: nobody:x:99:99:Nobody:/:/sbin/nologin 
EXPECTED RESULT: nobody:x:99:99:Nobody:/:/sbin/nologin
RETURN CODE: 0
PASS
COMMAND:  cat /etc/passwd | grep sshd
RESULT: sshd:x:74:74:Privilege-separated SSH:/var/empty/sshd:/sbin/nologin 
EXPECTED RESULT: sshd:x:74:74:Privilege-separated SSH:/var/empty/sshd:/sbin/nologin
RETURN CODE: 0
PASS
######################################################################################
# NEW TEST: ## Verify runlevel ... 
######################################################################################
COMMAND:  cat /etc/inittab | grep id:
RESULT: id:3:initdefault: 
EXPECTED RESULT: id:3:initdefault:
RETURN CODE: 0
PASS
######################################################################################
# NEW TEST: ## Verify new shells file ... 
######################################################################################
COMMAND:  cat /etc/shells | grep bash
RESULT: /bin/bash 
EXPECTED RESULT: /bin/bash
RETURN CODE: 0
PASS
COMMAND:  cat /etc/shells | grep nologin
RESULT: /sbin/nologin 
EXPECTED RESULT: /sbin/nologin
RETURN CODE: 0
PASS
######################################################################################
# NEW TEST: ## Verify networking ... 
######################################################################################
COMMAND:  grep ^NETWORKING= /etc/sysconfig/network | cut -d\= -f2
RESULT: yes 
EXPECTED RESULT: yes
RETURN CODE: 0
PASS
######################################################################################
# NEW TEST: ## Verify device ... 
######################################################################################
COMMAND:  grep ^DEVICE= /etc/sysconfig/network-scripts/ifcfg-eth0 | cut -d\= -f2
RESULT: eth0 
EXPECTED RESULT: eth0
RETURN CODE: 0
PASS
######################################################################################
# NEW TEST: ## Verify iptables ... 
######################################################################################
COMMAND: /etc/init.d/iptables status | grep REJECT 
5    REJECT     all  --  0.0.0.0/0            0.0.0.0/0           reject-with icmp-host-prohibited 
1    REJECT     all  --  0.0.0.0/0            0.0.0.0/0           reject-with icmp-host-prohibited 
RETURN CODE: 0
COMMAND:  /etc/init.d/iptables status | grep :22 | grep ACCEPT | wc -l 
RESULT: 1 
EXPECTED RESULT: 1
RETURN CODE: 0
PASS
######################################################################################
# NEW TEST: ## Verify sshd ...
######################################################################################
COMMAND:  chkconfig --list | grep sshd
RESULT: sshd           	0:off	1:off	2:on	3:on	4:on	5:on	6:off 
EXPECTED RESULT: sshd           	0:off	1:off	2:on	3:on	4:on	5:on	6:off
RETURN CODE: 0
PASS
COMMAND:  /etc/init.d/sshd status | grep running | wc -l
RESULT: 1 
EXPECTED RESULT: 1
RETURN CODE: 0
PASS
######################################################################################
# NEW TEST: ## Verify  chkconfig ... 
######################################################################################
COMMAND:  chkconfig --list | grep crond | cut -f 5
RESULT: 3:on 
EXPECTED RESULT: 3:on
RETURN CODE: 0
PASS
COMMAND:  chkconfig --list | grep  iptables | cut -f 5
RESULT: 3:on 
EXPECTED RESULT: 3:on
RETURN CODE: 0
PASS
######################################################################################
# NEW TEST: ## Verify rsyslog is on ... 
######################################################################################
COMMAND:  chkconfig --list | grep rsyslog | cut -f 5
RESULT: 3:on 
EXPECTED RESULT: 3:on
RETURN CODE: 0
PASS
######################################################################################
# NEW TEST: ## Verify rsyslog config ... 
######################################################################################
COMMAND:  md5sum /etc/rsyslog.conf | cut -f 1 -d  " "
RESULT: dd356958ca9c4e779f7fac13dde3c1b5 
EXPECTED RESULT: dd356958ca9c4e779f7fac13dde3c1b5
RETURN CODE: 0
PASS
######################################################################################
# NEW TEST: ## Verify auditd is on ... 
######################################################################################
COMMAND:  /sbin/chkconfig --list auditd | grep 3:on
RESULT: auditd         	0:off	1:off	2:on	3:on	4:on	5:on	6:off 
EXPECTED RESULT: 
RETURN CODE: 0
PASS
COMMAND:  /sbin/chkconfig --list auditd | grep 5:on
RESULT: auditd         	0:off	1:off	2:on	3:on	4:on	5:on	6:off 
EXPECTED RESULT: 
RETURN CODE: 0
PASS
######################################################################################
# NEW TEST: ## Verify audit.rules ... 
######################################################################################
COMMAND:  md5sum /etc/audit/audit.rules | cut -f 1 -d  " "
RESULT: f9869e1191838c461f5b9051c78a638d 
EXPECTED RESULT: f9869e1191838c461f5b9051c78a638d
RETURN CODE: 0
PASS
######################################################################################
# NEW TEST: ## Verify auditd.conf ... 
######################################################################################
COMMAND:  md5sum /etc/audit/auditd.conf | cut -f 1 -d  " "
RESULT: 612ddf28c3916530d47ef56a1b1ed1ed 
EXPECTED RESULT: 612ddf28c3916530d47ef56a1b1ed1ed
RETURN CODE: 0
PASS
######################################################################################
# NEW TEST: ## Verify auditd sysconfig ... 
######################################################################################
COMMAND:  md5sum /etc/sysconfig/auditd | cut -f 1 -d  " "
RESULT: 123beb3a97a32d96eba4f11509e39da2 
EXPECTED RESULT: 123beb3a97a32d96eba4f11509e39da2
RETURN CODE: 0
PASS
######################################################################################
# NEW TEST: ## Verify sshd_config settings ...
######################################################################################
COMMAND:  cat /etc/ssh/sshd_config  | grep  PasswordAuthentication | grep no | wc -l
RESULT: 1 
EXPECTED RESULT: 1
RETURN CODE: 0
PASS
######################################################################################
# NEW TEST: ## Verify /etc/ld.so.conf.d/libc6-xen.conf is not present ... 
######################################################################################
COMMAND:  ls /etc/ld.so.conf.d/libc6-xen.conf
ls: cannot access /etc/ld.so.conf.d/libc6-xen.conf: No such file or directory
RESULT:  
EXPECTED RESULT: 2
RETURN CODE: 2
PASS
######################################################################################
# NEW TEST: ##test menu.lst ... 
######################################################################################
COMMAND:  file /boot/grub/menu.lst  | grep symbolic | wc -l
RESULT: 1 
EXPECTED RESULT: 1
RETURN CODE: 0
PASS
COMMAND:  file /boot/grub/menu.lst  | grep grub.conf | wc -l
RESULT: 1 
EXPECTED RESULT: 1
RETURN CODE: 0
PASS
COMMAND:  cat /boot/grub/grub.conf  | grep "(hd0,0)" | wc -l
RESULT: 0 
EXPECTED RESULT: 0
RETURN CODE: 0
PASS
######################################################################################
# NEW TEST: ## Verify resize2fs ... 
######################################################################################
COMMAND: resize2fs -p /dev/xvde1 15000M
resize2fs 1.41.12 (17-May-2010)
RETURN CODE: 0
COMMAND:  df -h | grep 15G | wc -l 
RESULT: 1 
EXPECTED RESULT: 1
RETURN CODE: 0
PASS
######################################################################################
# NEW TEST: Fetching Host Details 
######################################################################################
This Host => ec2-50-18-0-237.us-west-1.compute.amazonaws.com with Image Id : ami-03f3ae46, is launched with Instance Id : i-7b924a3c , Instance Type : m1.small and Arch : i386 in the Region : us-west-1b
This is a Hourly image
The Validate Signature is : ZVVL820PhRMOWImQL30tXB0dJaNUHVHXgeZmpJLdZzSiu5qSHCcDxXLLjIXBg5ppVtQXFUc9wru/
STt7Dj+Rt+ujP5Y2LrPp3dMKDEVM6eLyvAeDJ3WUIhpB0CpQPeC6X1AGSTpzAhDMUMvsl5g0F0mu
MrgX634pXr1eufbDESc=

## Summary ##
FAILURES = 3
FAILED TESTS = ## Verify turning on/off swap file ... ## Verify swap size ... ## Verify RPMs ...
LOG FILE = /root/valid/src/validate.log
## Summary ##

######################################################################################
# NEW TEST: ## Open a bugzilla
######################################################################################

Comment 13 wes hayutin 2011-12-16 15:32:03 UTC
closing old bugs


Note You need to log in before you can comment on or make changes to this bug.