Bug 832914 - ami-28d6907a 6.3 i386 ap-southeast-1
ami-28d6907a 6.3 i386 ap-southeast-1
Status: CLOSED CURRENTRELEASE
Product: Cloud Image Validation
Classification: Red Hat
Component: images (Show other bugs)
RHEL6.3
i386 Unspecified
unspecified Severity unspecified
: ---
: ---
Assigned To: wes hayutin
mkovacik
:
Depends On:
Blocks:
  Show dependency treegraph
 
Reported: 2012-06-18 03:59 EDT by mkovacik
Modified: 2012-06-18 05:01 EDT (History)
0 users

See Also:
Fixed In Version:
Doc Type: Bug Fix
Doc Text:
Story Points: ---
Clone Of:
Environment:
Last Closed: 2012-06-18 05:01:48 EDT
Type: ---
Regression: ---
Mount Type: ---
Documentation: ---
CRM:
Verified Versions:
Category: ---
oVirt Team: ---
RHEL 7.3 requirements from Atomic Host:
Cloudforms Team: ---


Attachments (Terms of Use)

  None (edit)
Description mkovacik 2012-06-18 03:59:12 EDT

    
Comment 1 mkovacik 2012-06-18 04:06:01 EDT
IMAGE ID= 
Preparing...                ##################################################
epel-release                ##################################################
Loaded plugins: amazon-id, product-id, rhui-lb, security, subscription-manager
Updating certificate-based repositories.
Setting up Install Process
Resolving Dependencies
--> Running transaction check
---> Package python-bugzilla.noarch 0:0.6.0-1.el6 will be installed
--> Finished Dependency Resolution

Dependencies Resolved

================================================================================
 Package                 Arch           Version              Repository    Size
================================================================================
Installing:
 python-bugzilla         noarch         0.6.0-1.el6          epel          71 k

Transaction Summary
================================================================================
Install       1 Package(s)

Total download size: 71 k
Installed size: 309 k
Downloading Packages:
Retrieving key from file:///etc/pki/rpm-gpg/RPM-GPG-KEY-EPEL-6
Running rpm_check_debug
Running Transaction Test
Transaction Test Succeeded
Running Transaction

  Installing : python-bugzilla-0.6.0-1.el6.noarch                           1/1 
Installed products updated.

  Verifying  : python-bugzilla-0.6.0-1.el6.noarch                           1/1 

Installed:
  python-bugzilla.noarch 0:0.6.0-1.el6                                          

Complete!
=====image_validation.sh Mon Jun 18 04:04:00 EDT 2012=====
######################################################################################
# NEW TEST: ## Open a bugzilla
######################################################################################
######################################################################################
# NEW TEST: Fetching the identity doc Details
######################################################################################
Verifying that signature exists
COMMAND:  echo 1
RESULT: 1 
EXPECTED RESULT: 1
RETURN CODE: 0
PASS
Verifying the IMAGE ID
COMMAND:  echo 1
RESULT: 1 
EXPECTED RESULT: 1
RETURN CODE: 0
PASS
Verifying the Architecture
COMMAND:  echo 1
RESULT: 1 
EXPECTED RESULT: 1
RETURN CODE: 0
PASS
This Host => ec2-175-41-174-34.ap-southeast-1.compute.amazonaws.com with Image Id : ami-28d6907a, is launched with Instance Id : i-540d9d00 , Instance Type : c1.medium and Arch : i386 in the Region : ap-southeast-1a
The Validate Signature is : VyqIlQ3dp9kd+D/xlHecknjSNkzLaHcTs8RnQpnAJ8I+miFRSqIp9rqWv3VRnaPDXWnV+0LDYwnT
Hi3h0zwj4rLM52Kdg9Qz6eqvIKygw813DUBseYAKrl68f71rsZhc2OkcsI0qYrTmIUehrGopYoYe
fjfHCcCpgTHmuY50U6o=
This is a Cloud Access image
/root/valid/src
ip-10-128-159-150
Red Hat Enterprise Linux Server release 6.3 (Santiago)
######################################################################################
# NEW TEST: The selected image has the version RHEL 6.3
######################################################################################
######################################################################################
# NEW TEST: ## Verify auditd is on ... 
######################################################################################
COMMAND:  /sbin/chkconfig --list auditd | grep 3:on
RESULT: auditd         	0:off	1:off	2:on	3:on	4:on	5:on	6:off 
EXPECTED RESULT: 
RETURN CODE: 0
PASS
COMMAND:  /sbin/chkconfig --list auditd | grep 5:on
RESULT: auditd         	0:off	1:off	2:on	3:on	4:on	5:on	6:off 
EXPECTED RESULT: 
RETURN CODE: 0
PASS
######################################################################################
# NEW TEST: ## Verify audit.rules ... 
######################################################################################
COMMAND:  md5sum /etc/audit/audit.rules | cut -f 1 -d  " "
RESULT: f9869e1191838c461f5b9051c78a638d 
EXPECTED RESULT: f9869e1191838c461f5b9051c78a638d
RETURN CODE: 0
PASS
######################################################################################
# NEW TEST: ## Verify auditd.conf ... 
######################################################################################
COMMAND:  md5sum /etc/audit/auditd.conf | cut -f 1 -d  " "
RESULT: e1886162554c18906df2ecd258aa4794 
EXPECTED RESULT: e1886162554c18906df2ecd258aa4794
RETURN CODE: 0
PASS
######################################################################################
# NEW TEST: ## Verify auditd sysconfig ... 
######################################################################################
COMMAND:  md5sum /etc/sysconfig/auditd | cut -f 1 -d  " "
RESULT: d4d43637708e30418c30003e212f76fc 
EXPECTED RESULT: d4d43637708e30418c30003e212f76fc
RETURN CODE: 0
PASS
######################################################################################
# NEW TEST: ## Verify bash_history ... 
######################################################################################
COMMAND:  cat ~/.bash_history | wc -l 
cat: /root/.bash_history: No such file or directory
RESULT: 0 
EXPECTED RESULT: 0
RETURN CODE: 0
PASS
######################################################################################
# NEW TEST: ## Verify  chkconfig ... 
######################################################################################
COMMAND:  chkconfig --list | grep crond | cut -f 5
RESULT: 3:on 
EXPECTED RESULT: 3:on
RETURN CODE: 0
PASS
COMMAND:  chkconfig --list | grep  iptables | cut -f 5
RESULT: 3:on 
EXPECTED RESULT: 3:on
RETURN CODE: 0
PASS
######################################################################################
# NEW TEST: ## Verify rh-cloud-firstboot is OFF ... 
######################################################################################
COMMAND:  chkconfig --list | grep rh-cloud | grep 3:off | wc -l
RESULT: 1 
EXPECTED RESULT: 1
RETURN CODE: 0
PASS
/etc/sysconfig/rh-cloud-firstboot FOUND
COMMAND:  echo true
RESULT: true 
EXPECTED RESULT: 
RETURN CODE: 0
PASS
COMMAND:  cat /etc/sysconfig/rh-cloud-firstboot
RESULT: RUN_FIRSTBOOT=NO 
EXPECTED RESULT: RUN_FIRSTBOOT=NO
RETURN CODE: 0
PASS
######################################################################################
# NEW TEST: ## Partition Format  ...
######################################################################################
mount | grep /dev/xvde1 | awk '{ print  }'
COMMAND:  echo ext4
RESULT: ext4 
EXPECTED RESULT: ext4
RETURN CODE: 0
PASS
######################################################################################
# NEW TEST: ## Partition Size ...
######################################################################################
size=5905712
COMMAND:  echo true
RESULT: true 
EXPECTED RESULT: true
RETURN CODE: 0
PASS
######################################################################################
# NEW TEST: Fetching the identity doc Details
######################################################################################
Verifying that signature exists
COMMAND:  echo 1
RESULT: 1 
EXPECTED RESULT: 1
RETURN CODE: 0
PASS
Verifying the IMAGE ID
COMMAND:  echo 1
RESULT: 1 
EXPECTED RESULT: 1
RETURN CODE: 0
PASS
Verifying the Architecture
COMMAND:  echo 1
RESULT: 1 
EXPECTED RESULT: 1
RETURN CODE: 0
PASS
This Host => ec2-175-41-174-34.ap-southeast-1.compute.amazonaws.com with Image Id : ami-28d6907a, is launched with Instance Id : i-540d9d00 , Instance Type : c1.medium and Arch : i386 in the Region : ap-southeast-1a
The Validate Signature is : VyqIlQ3dp9kd+D/xlHecknjSNkzLaHcTs8RnQpnAJ8I+miFRSqIp9rqWv3VRnaPDXWnV+0LDYwnT
Hi3h0zwj4rLM52Kdg9Qz6eqvIKygw813DUBseYAKrl68f71rsZhc2OkcsI0qYrTmIUehrGopYoYe
fjfHCcCpgTHmuY50U6o=
This is a Cloud Access image
######################################################################################
# NEW TEST: ## Verify GPG checking ... 
######################################################################################
COMMAND:  grep '^gpgcheck=1' /etc/yum.repos.d/redhat-*.repo | cut -d\= -f2 | sort -f | uniq
RESULT: 1 
EXPECTED RESULT: 1
RETURN CODE: 0
PASS
######################################################################################
# NEW TEST: ## Verify GPG RPMS ... 
######################################################################################
COMMAND:  rpm -qa gpg-pubkey* | grep -o -F gpg-pubkey-2fa658e0-45700c69
RESULT: gpg-pubkey-2fa658e0-45700c69 
EXPECTED RESULT: gpg-pubkey-2fa658e0-45700c69
RETURN CODE: 0
PASS
COMMAND:  rpm -qa gpg-pubkey* | grep -o -F gpg-pubkey-fd431d51-4ae0493b
RESULT: gpg-pubkey-fd431d51-4ae0493b 
EXPECTED RESULT: gpg-pubkey-fd431d51-4ae0493b
RETURN CODE: 0
PASS
######################################################################################
# NEW TEST: ## Verify group file ... 
######################################################################################
COMMAND:  cat /etc/group | grep root:x:0
RESULT: root:x:0: 
EXPECTED RESULT: root:x:0:
RETURN CODE: 0
PASS
COMMAND:  cat /etc/group | grep daemon:x:2
RESULT: daemon:x:2:bin,daemon 
EXPECTED RESULT: daemon:x:2:bin,daemon
RETURN CODE: 0
PASS
COMMAND:  cat /etc/group | grep bin:x:1
RESULT: bin:x:1:bin,daemon 
EXPECTED RESULT: bin:x:1:bin,daemon
RETURN CODE: 0
PASS
COMMAND:  cat /etc/group | grep nobody:x:99
RESULT: nobody:x:99: 
EXPECTED RESULT: nobody:x:99:
RETURN CODE: 0
PASS
######################################################################################
# NEW TEST: ##test menu.lst ... 
######################################################################################
COMMAND:  file /boot/grub/menu.lst  | grep symbolic | wc -l
RESULT: 1 
EXPECTED RESULT: 1
RETURN CODE: 0
PASS
COMMAND:  file /boot/grub/menu.lst  | grep grub.conf | wc -l
RESULT: 1 
EXPECTED RESULT: 1
RETURN CODE: 0
PASS
COMMAND:  cat /boot/grub/grub.conf  | grep "(hd0,0)" | wc -l
RESULT: 0 
EXPECTED RESULT: 0
RETURN CODE: 0
PASS
######################################################################################
# NEW TEST: ## Verify runlevel ... 
######################################################################################
COMMAND:  cat /etc/inittab | grep id:
RESULT: id:3:initdefault: 
EXPECTED RESULT: id:3:initdefault:
RETURN CODE: 0
PASS
######################################################################################
# NEW TEST: ## Verify iptables ... 
######################################################################################
COMMAND: /etc/init.d/iptables status | grep REJECT 
5    REJECT     all  --  0.0.0.0/0            0.0.0.0/0           reject-with icmp-host-prohibited 
1    REJECT     all  --  0.0.0.0/0            0.0.0.0/0           reject-with icmp-host-prohibited 
RETURN CODE: 0
COMMAND:  /etc/init.d/iptables status | grep :22 | grep ACCEPT | wc -l 
RESULT: 1 
EXPECTED RESULT: 1
RETURN CODE: 0
PASS
######################################################################################
# NEW TEST: ## Verify /etc/ld.so.conf.d/libc6-xen.conf is not present ... 
######################################################################################
COMMAND:  ls /etc/ld.so.conf.d/libc6-xen.conf
ls: cannot access /etc/ld.so.conf.d/libc6-xen.conf: No such file or directory
RESULT:  
EXPECTED RESULT: 2
RETURN CODE: 2
PASS
######################################################################################
# NEW TEST: ##Verify memory match hwp ... 
######################################################################################
cat /proc/meminfo | grep MemTotal: | awk '{print }'
FOUND MEMORY OF 1752696 > hwp MEMORY of 1700000
COMMAND:  echo true
RESULT: true 
EXPECTED RESULT: 
RETURN CODE: 0
PASS
######################################################################################
# NEW TEST: ## Verify nameserver ... 
######################################################################################
COMMAND:  /usr/bin/dig clock.redhat.com 2>> /root/valid/src/validate.log | grep 66.187.233.4  | wc -l
RESULT: 1 
EXPECTED RESULT: 
RETURN CODE: 0
PASS
######################################################################################
# NEW TEST: ## Verify networking ... 
######################################################################################
COMMAND:  grep ^NETWORKING= /etc/sysconfig/network | cut -d\= -f2
RESULT: yes 
EXPECTED RESULT: yes
RETURN CODE: 0
PASS
######################################################################################
# NEW TEST: ## Verify device ... 
######################################################################################
COMMAND:  grep ^DEVICE= /etc/sysconfig/network-scripts/ifcfg-eth0 | cut -d\= -f2
RESULT: eth0 
EXPECTED RESULT: eth0
RETURN CODE: 0
PASS
######################################################################################
# NEW TEST: ## Verify no missing packages ... 
######################################################################################
COMMAND: /bin/rpm -qa --queryformat='%{NAME}\n' > /tmp/rpmqa.tmp
RETURN CODE: 0
COMMAND: comm -23 packages_63 /tmp/rpmqa
RETURN CODE: 0
COUNT = 0
COMMAND:  echo test passed
RESULT: test passed 
EXPECTED RESULT: 0
RETURN CODE: 0
PASS
######################################################################################
# NEW TEST: ## Verify new passwd file ... 
######################################################################################
COMMAND:  cat /etc/passwd | grep root:x:0
RESULT: root:x:0:0:root:/root:/bin/bash 
EXPECTED RESULT: root:x:0:0:root:/root:/bin/bash
RETURN CODE: 0
PASS
COMMAND:  cat /etc/passwd | grep nobody:x:99
RESULT: nobody:x:99:99:Nobody:/:/sbin/nologin 
EXPECTED RESULT: nobody:x:99:99:Nobody:/:/sbin/nologin
RETURN CODE: 0
PASS
COMMAND:  cat /etc/passwd | grep sshd
RESULT: sshd:x:74:74:Privilege-separated SSH:/var/empty/sshd:/sbin/nologin 
EXPECTED RESULT: sshd:x:74:74:Privilege-separated SSH:/var/empty/sshd:/sbin/nologin
RETURN CODE: 0
PASS
######################################################################################
# NEW TEST: ## test repo files ... 
######################################################################################
COMMAND:  ls -I 'epel*'  /etc/yum.repos.d/ | wc -l 
RESULT: 4 
EXPECTED RESULT: 4
RETURN CODE: 0
PASS
COMMAND:  ls /etc/yum.repos.d/redhat* | wc -l
RESULT: 2 
EXPECTED RESULT: 2
RETURN CODE: 0
PASS
COMMAND:  ls /etc/yum.repos.d/rhel* | wc -l
RESULT: 1 
EXPECTED RESULT: 0
RETURN CODE: 0
PASS
######################################################################################
# NEW TEST: ## Verify resize2fs ... 
######################################################################################
COMMAND: resize2fs -p /dev/xvde1 15000M
resize2fs 1.41.12 (17-May-2010)
RETURN CODE: 0
COMMAND:  df -h | grep 15G | wc -l 
RESULT: 1 
EXPECTED RESULT: 1
RETURN CODE: 0
PASS
/root/valid/src
ip-10-128-159-150
Red Hat Enterprise Linux Server release 6.3 (Santiago)
######################################################################################
# NEW TEST: The selected image has the version RHEL 6.3
######################################################################################
######################################################################################
# NEW TEST: ## /sbin/getenforce ... 
######################################################################################
COMMAND:  /usr/sbin/getenforce
RESULT: Enforcing 
EXPECTED RESULT: Enforcing
RETURN CODE: 0
PASS
######################################################################################
# NEW TEST: ## Verify SELINUX enforcing ... 
######################################################################################
COMMAND:  grep ^SELINUX= /etc/sysconfig/selinux | cut -d\= -f2
RESULT: enforcing 
EXPECTED RESULT: enforcing
RETURN CODE: 0
PASS
######################################################################################
# NEW TEST: ## Verify SELINUXTYPE targeted ... 
######################################################################################
COMMAND:  grep ^SELINUXTYPE= /etc/sysconfig/selinux | cut -d\= -f2
RESULT: targeted 
EXPECTED RESULT: targeted
RETURN CODE: 0
PASS
######################################################################################
# NEW TEST: ## Flip Selinux Permissive ... 
######################################################################################
COMMAND:  /usr/sbin/setenforce Permissive && /usr/sbin/getenforce
RESULT: Permissive 
EXPECTED RESULT: Permissive
RETURN CODE: 0
PASS
######################################################################################
# NEW TEST: ## Flip Selinux Enforcing ... 
######################################################################################
COMMAND:  /usr/sbin/setenforce Enforcing && /usr/sbin/getenforce
RESULT: Enforcing 
EXPECTED RESULT: Enforcing
RETURN CODE: 0
PASS
######################################################################################
# NEW TEST: ## Verify new shells file ... 
######################################################################################
COMMAND:  cat /etc/shells | grep bash
RESULT: /bin/bash 
EXPECTED RESULT: /bin/bash
RETURN CODE: 0
PASS
COMMAND:  cat /etc/shells | grep nologin
RESULT: /sbin/nologin 
EXPECTED RESULT: /sbin/nologin
RETURN CODE: 0
PASS
######################################################################################
# NEW TEST: ## Verify sshd_config settings ...
######################################################################################
COMMAND:  cat /etc/ssh/sshd_config  | grep  PasswordAuthentication | grep no | wc -l
RESULT: 1 
EXPECTED RESULT: 1
RETURN CODE: 0
PASS
######################################################################################
# NEW TEST: ## Verify sshd ...
######################################################################################
COMMAND:  chkconfig --list | grep sshd
RESULT: sshd           	0:off	1:off	2:on	3:on	4:on	5:on	6:off 
EXPECTED RESULT: sshd           	0:off	1:off	2:on	3:on	4:on	5:on	6:off
RETURN CODE: 0
PASS
COMMAND:  /etc/init.d/sshd status | grep running | wc -l
RESULT: 1 
EXPECTED RESULT: 1
RETURN CODE: 0
PASS
######################################################################################
# NEW TEST: ## Verify swap size ... 
######################################################################################
parted -l | grep linux-swap | awk '{print $4}' | awk -F'MB' '{print $1}'
swap size = 940
COMMAND:  test 940 -gt 0
RESULT:  
EXPECTED RESULT: 
RETURN CODE: 0
PASS
######################################################################################
# NEW TEST: ## Verify turning on/off swap file ... 
######################################################################################
COMMAND:  /sbin/swapoff /dev/xvde3 && /sbin/swapon /dev/xvde3
RESULT:  
EXPECTED RESULT: 
RETURN CODE: 0
PASS
######################################################################################
# NEW TEST: ## Verify rsyslog is on ... 
######################################################################################
COMMAND:  chkconfig --list | grep rsyslog | cut -f 5
RESULT: 3:on 
EXPECTED RESULT: 3:on
RETURN CODE: 0
PASS
######################################################################################
# NEW TEST: ## Verify rsyslog config ... 
######################################################################################
COMMAND:  md5sum /etc/rsyslog.conf | cut -f 1 -d  " "
RESULT: 8b91b32300134e98ef4aee632ed61e21 
EXPECTED RESULT: 8b91b32300134e98ef4aee632ed61e21
RETURN CODE: 0
PASS
######################################################################################
# NEW TEST: ## Verify no systemid file ... 
######################################################################################
COMMAND:  echo true
Comment 2 mkovacik 2012-06-18 04:06:11 EDT
RESULT: true 
EXPECTED RESULT: 
RETURN CODE: 0
PASS
######################################################################################
# NEW TEST: ## Verify kernel name ... 
######################################################################################
COMMAND:  /bin/uname -s
RESULT: Linux 
EXPECTED RESULT: Linux
RETURN CODE: 0
PASS
######################################################################################
# NEW TEST: ## Verify latest installed kernel is running ... 
######################################################################################
Detected rpm kernel version: 2.6.32-276.el6.i686
Detected uname kernel version: 2.6.32-276.el6.i686
COMMAND:  true
RESULT:  
EXPECTED RESULT: 
RETURN CODE: 0
PASS
######################################################################################
# NEW TEST: ## Verify latest kenerl is in /boot/grub/menu.1st ... 
######################################################################################
COMMAND:  cat /boot/grub/menu.lst | grep 2.6.32-276.el6.i686
RESULT: title RHEL6.3-20120531.0-Server-i386-starter-ec2 (2.6.32-276.el6.i686)
        kernel /boot/vmlinuz-2.6.32-276.el6.i686 ro root=LABEL=_/ 
        initrd /boot/initramfs-2.6.32-276.el6.i686.img 
EXPECTED RESULT: 
RETURN CODE: 0
PASS
######################################################################################
# NEW TEST: ## Verify operating system ... 
######################################################################################
COMMAND:  /bin/uname -o
RESULT: GNU/Linux 
EXPECTED RESULT: GNU/Linux
RETURN CODE: 0
PASS
######################################################################################
# NEW TEST: ## Verify /etc/sysconfig/kernel ... 
######################################################################################
COMMAND:  ls /etc/sysconfig/kernel
RESULT: /etc/sysconfig/kernel 
EXPECTED RESULT: 
RETURN CODE: 0
PASS
######################################################################################
# NEW TEST: ## Verify /etc/sysconfig/kernel contains UPDATEDEFAULT ... 
######################################################################################
COMMAND:  cat /etc/sysconfig/kernel | grep UPDATEDEFAULT=yes
RESULT: UPDATEDEFAULT=yes 
EXPECTED RESULT: 
RETURN CODE: 0
PASS
######################################################################################
# NEW TEST: ## Verify /etc/sysconfig/kernel contains DEFAULTKERNEL ... 
######################################################################################
COMMAND:  cat /etc/sysconfig/kernel | grep DEFAULTKERNEL=kernel
RESULT: DEFAULTKERNEL=kernel 
EXPECTED RESULT: 
RETURN CODE: 0
PASS
######################################################################################
# NEW TEST: ## Verify system up to date
######################################################################################
COMMAND:  _check_sys_update_phase1
# no update was required
RESULT: # checking sys update done
# no update was required 
EXPECTED RESULT: 
RETURN CODE: 0
PASS
######################################################################################
# NEW TEST: ## Verify RPMs ... 
######################################################################################
....L....  c /etc/pam.d/fingerprint-auth
....L....  c /etc/pam.d/password-auth
....L....  c /etc/pam.d/smartcard-auth
....L....  c /etc/pam.d/system-auth
.M.......    /var/cache/yum
    S file Size differs
    M Mode differs (includes permissions and file type)
    5 MD5 sum differs
    D Device major/minor number mismatch
    L readLink(2) path mismatch
    U User ownership differs
    G Group ownership differs
    T mTime differs

COMMAND:  cat /tmp/rpmqaV.txt | wc -l
RESULT: 5 
EXPECTED RESULT: 5
RETURN CODE: 0
PASS
######################################################################################
# NEW TEST: ## Verify Version 2 ... 
######################################################################################
COMMAND:  /bin/rpm -q --queryformat '%{RELEASE}\n' redhat-release-server | cut -d. -f1,2
RESULT: 6.3 
EXPECTED RESULT: 6.3
RETURN CODE: 0
PASS
######################################################################################
# NEW TEST: ## Verify packager ... 
######################################################################################
COMMAND:  cat /tmp/Packager | grep -v 'Red Hat, Inc.' |  grep -v crash-trace-commandPackager| wc -l
RESULT: 2 
EXPECTED RESULT: 0
RETURN CODE: 0
PASS
crash-trace-commandPackager    : Lai Jiangshan <laijs@cn.fujitsu.com>
epel-releasePackager    : Fedora Project
python-bugzillaPackager    : Fedora Project
######################################################################################
# NEW TEST: ## List the configured repositories...
######################################################################################
COMMAND:  /usr/bin/yum repolist
Unable to read consumer identity
RESULT: Loaded plugins: amazon-id, product-id, rhui-lb, security, subscription-manager
Updating certificate-based repositories.
repo id                                           repo name               status
epel                                              Extra Packages for Ente 6,111
rhui-ap-southeast-1-client-config-server-6        Red Hat Update Infrastr     1
rhui-ap-southeast-1-rhel-server-releases          Red Hat Enterprise Linu 5,587
rhui-ap-southeast-1-rhel-server-releases-optional Red Hat Enterprise Linu 3,344
repolist: 15,043 
EXPECTED RESULT: 
RETURN CODE: 0
PASS
######################################################################################
# NEW TEST: ## Search zsh...
######################################################################################
COMMAND:  /usr/bin/yum search zsh
Unable to read consumer identity
RESULT: Loaded plugins: amazon-id, product-id, rhui-lb, security, subscription-manager
Updating certificate-based repositories.
=============================== N/S Matched: zsh ===============================
autojump-zsh.noarch : Autojump for zsh
gromacs-zsh.noarch : GROMACS zsh support
python-twisted-core-zsh.i686 : Tab completion for Zsh and Twisted Core
zsh-html.i686 : Zsh shell manual in html format
zsh.i686 : A powerful interactive shell

  Name and summary matches only, use "search all" for everything. 
EXPECTED RESULT: 
RETURN CODE: 0
PASS
######################################################################################
# NEW TEST: ## install zsh ... 
######################################################################################
COMMAND: /usr/bin/yum -y install zsh
Unable to read consumer identity
RETURN CODE: 0
COMMAND:  /bin/rpm -q --queryformat '%{NAME}\n' zsh
RESULT: zsh 
EXPECTED RESULT: zsh
RETURN CODE: 0
PASS
######################################################################################
# NEW TEST: ## List available groups..
######################################################################################
COMMAND:  /usr/bin/yum grouplist
Unable to read consumer identity
RESULT: Loaded plugins: amazon-id, product-id, rhui-lb, security, subscription-manager
Updating certificate-based repositories.
Setting up Group Process
Installed Groups:
   Additional Development
   Base
   Client management tools
   Console internet tools
   Debugging Tools
   Desktop Platform
   Directory Client
   E-mail server
   Fonts
   Graphical Administration Tools
   Hardware monitoring utilities
   Java Platform
   Large Systems Performance
   Legacy UNIX compatibility
   Messaging Client Support
   Messaging Server Support
   Milkymist
   NFS file server
   Network file system client
   Networking Tools
   Performance Tools
   Perl Support
   Scientific support
   Server Platform
Installed Language Groups:
   Arabic Support [ar]
   Armenian Support [hy]
   Georgian Support [ka]
   Hebrew Support [he]
   Inuktitut Support [iu]
   Japanese Support [ja]
   Korean Support [ko]
   Lao Support [lo]
   Tajik Support [tg]
Available Groups:
   Backup Client
   Backup Server
   CIFS file server
   Compatibility libraries
   Desktop
   Desktop Debugging and Performance Tools
   Desktop Platform Development
   Development tools
   Dial-up Networking Support
   Directory Server
   Eclipse
   Educational Software
   Electronic Lab
   Emacs
   FCoE Storage Client
   FTP server
   Fedora Packager
   General Purpose Desktop
   Graphics Creation Tools
   Haskell
   Identity Management Server
   Infiniband Support
   Input Methods
   Internet Applications
   Internet Browser
   KDE Desktop
   Legacy X Window System compatibility
   Mainframe Access
   MySQL Database client
   MySQL Database server
   Network Infrastructure Server
   Network Storage Server
   Office Suite and Productivity
   PHP Support
   PostgreSQL Database client
   PostgreSQL Database server
   Print Server
   Printing client
   Remote Desktop Clients
   Ruby Support
   SNMP Support
   Security Tools
   Server Platform Development
   Smart card support
   Somali Support
   Storage Availability Tools
   System Management
   System administration tools
   TeX support
   Technical Writing
   TurboGears application framework
   Virtualization
   Virtualization Client
   Virtualization Platform
   Virtualization Tools
   Web Server
   Web Servlet Engine
   Web-Based Enterprise Management
   X Window System
   Xfce
   iSCSI Storage Client
Available Language Groups:
   Afrikaans Support [af]
   Albanian Support [sq]
   Amazigh Support [ber]
   Assamese Support [as]
   Azerbaijani Support [az]
   Basque Support [eu]
   Belarusian Support [be]
   Bengali Support [bn]
   Bhutanese Support [dz]
   Brazilian Portuguese Support [pt_BR]
   Breton Support [br]
   Bulgarian Support [bg]
   Catalan Support [ca]
   Chhattisgarhi Support [hne]
   Chichewa Support [ny]
   Chinese Support [zh]
   Coptic Support [cop]
   Croatian Support [hr]
   Czech Support [cs]
   Danish Support [da]
   Dutch Support [nl]
   English (UK) Support [en_GB]
   Esperanto Support [eo]
   Estonian Support [et]
   Ethiopic Support [am]
   Faroese Support [fo]
   Fijian Support [fj]
   Filipino Support [fil]
   Finnish Support [fi]
   French Support [fr]
   Frisian Support [fy]
   Friulian Support [fur]
   Gaelic Support [gd]
   Galician Support [gl]
   German Support [de]
   Greek Support [el]
   Gujarati Support [gu]
   Hiligaynon Support [hil]
   Hindi Support [hi]
   Hungarian Support [hu]
   Icelandic Support [is]
   Indonesian Support [id]
   Interlingua Support [ia]
   Irish Support [ga]
   Italian Support [it]
   Kannada Support [kn]
   Kashmiri Support [ks]
   Kashubian Support [csb]
   Kazakh Support [kk]
   Khmer Support [km]
   Kinyarwanda Support [rw]
   Konkani Support [kok]
   Kurdish Support [ku]
   Latin Support [la]
   Latvian Support [lv]
   Lithuanian Support [lt]
   Low Saxon Support [nds]
   Luxembourgish Support [lb]
   Macedonian Support [mk]
   Maithili Support [mai]
   Malagasy Support [mg]
   Malay Support [ms]
   Malayalam Support [ml]
   Maltese Support [mt]
   Manx Support [gv]
   Maori Support [mi]
   Marathi Support [mr]
   Mongolian Support [mn]
   Myanmar (Burmese) Support [my]
   Nepali Support [ne]
   Northern Sotho Support [nso]
   Norwegian Support [nb]
   Occitan Support [oc]
   Oriya Support [or]
   Persian Support [fa]
   Polish Support [pl]
   Portuguese Support [pt]
   Punjabi Support [pa]
   Romanian Support [ro]
   Russian Support [ru]
   Sanskrit Support [sa]
   Sardinian Support [sc]
   Serbian Support [sr]
   Sindhi Support [sd]
   Sinhala Support [si]
   Slovak Support [sk]
   Slovenian Support [sl]
   Southern Ndebele Support [nr]
   Southern Sotho Support [st]
   Spanish Support [es]
   Swahili Support [sw]
   Swati Support [ss]
   Swedish Support [sv]
   Tagalog Support [tl]
   Tamil Support [ta]
   Telugu Support [te]
   Tetum Support [tet]
   Thai Support [th]
   Tibetan Support [bo]
   Tsonga Support [ts]
   Tswana Support [tn]
   Turkish Support [tr]
   Turkmen Support [tk]
   Ukrainian Support [uk]
   Upper Sorbian Support [hsb]
   Urdu Support [ur]
   Uzbek Support [uz]
   Venda Support [ve]
   Vietnamese Support [vi]
   Walloon Support [wa]
   Welsh Support [cy]
   Xhosa Support [xh]
   Zulu Support [zu]
Done 
EXPECTED RESULT: 
RETURN CODE: 0
PASS
######################################################################################
# NEW TEST: ## Install Development tools group...
######################################################################################
COMMAND:  /usr/bin/yum -y groupinstall 'Development tools'
Unable to read consumer identity
Error: Package: glibc-devel-2.12-1.47.el6_2.12.i686 (rhui-ap-southeast-1-rhel-server-releases)
           Requires: glibc = 2.12-1.47.el6_2.12
           Installed: glibc-2.12-1.80.el6.i686 (@koji-override-0/$releasever)
               glibc = 2.12-1.80.el6
           Available: glibc-2.12-1.7.el6.i686 (rhui-ap-southeast-1-rhel-server-releases)
               glibc = 2.12-1.7.el6
           Available: glibc-2.12-1.7.el6_0.3.i686 (rhui-ap-southeast-1-rhel-server-releases)
               glibc = 2.12-1.7.el6_0.3
           Available: glibc-2.12-1.7.el6_0.4.i686 (rhui-ap-southeast-1-rhel-server-releases)
               glibc = 2.12-1.7.el6_0.4
           Available: glibc-2.12-1.7.el6_0.5.i686 (rhui-ap-southeast-1-rhel-server-releases)
               glibc = 2.12-1.7.el6_0.5
           Available: glibc-2.12-1.25.el6.i686 (rhui-ap-southeast-1-rhel-server-releases)
               glibc = 2.12-1.25.el6
           Available: glibc-2.12-1.25.el6_1.3.i686 (rhui-ap-southeast-1-rhel-server-releases)
               glibc = 2.12-1.25.el6_1.3
           Available: glibc-2.12-1.47.el6.i686 (rhui-ap-southeast-1-rhel-server-releases)
               glibc = 2.12-1.47.el6
           Available: glibc-2.12-1.47.el6_2.5.i686 (rhui-ap-southeast-1-rhel-server-releases)
               glibc = 2.12-1.47.el6_2.5
           Available: glibc-2.12-1.47.el6_2.9.i686 (rhui-ap-southeast-1-rhel-server-releases)
               glibc = 2.12-1.47.el6_2.9
           Available: glibc-2.12-1.47.el6_2.12.i686 (rhui-ap-southeast-1-rhel-server-releases)
               glibc = 2.12-1.47.el6_2.12
Error: Package: glibc-headers-2.12-1.47.el6_2.12.i686 (rhui-ap-southeast-1-rhel-server-releases)
           Requires: glibc = 2.12-1.47.el6_2.12
           Installed: glibc-2.12-1.80.el6.i686 (@koji-override-0/$releasever)
               glibc = 2.12-1.80.el6
           Available: glibc-2.12-1.7.el6.i686 (rhui-ap-southeast-1-rhel-server-releases)
               glibc = 2.12-1.7.el6
           Available: glibc-2.12-1.7.el6_0.3.i686 (rhui-ap-southeast-1-rhel-server-releases)
               glibc = 2.12-1.7.el6_0.3
           Available: glibc-2.12-1.7.el6_0.4.i686 (rhui-ap-southeast-1-rhel-server-releases)
               glibc = 2.12-1.7.el6_0.4
           Available: glibc-2.12-1.7.el6_0.5.i686 (rhui-ap-southeast-1-rhel-server-releases)
               glibc = 2.12-1.7.el6_0.5
           Available: glibc-2.12-1.25.el6.i686 (rhui-ap-southeast-1-rhel-server-releases)
               glibc = 2.12-1.25.el6
           Available: glibc-2.12-1.25.el6_1.3.i686 (rhui-ap-southeast-1-rhel-server-releases)
               glibc = 2.12-1.25.el6_1.3
           Available: glibc-2.12-1.47.el6.i686 (rhui-ap-southeast-1-rhel-server-releases)
               glibc = 2.12-1.47.el6
           Available: glibc-2.12-1.47.el6_2.5.i686 (rhui-ap-southeast-1-rhel-server-releases)
               glibc = 2.12-1.47.el6_2.5
           Available: glibc-2.12-1.47.el6_2.9.i686 (rhui-ap-southeast-1-rhel-server-releases)
               glibc = 2.12-1.47.el6_2.9
           Available: glibc-2.12-1.47.el6_2.12.i686 (rhui-ap-southeast-1-rhel-server-releases)
               glibc = 2.12-1.47.el6_2.12
Error: Package: rpm-build-4.8.0-19.el6_2.1.i686 (rhui-ap-southeast-1-rhel-server-releases)
           Requires: rpm = 4.8.0-19.el6_2.1
           Installed: rpm-4.8.0-27.el6.i686 (@koji-override-0/$releasever)
               rpm = 4.8.0-27.el6
           Available: rpm-4.8.0-12.el6.i686 (rhui-ap-southeast-1-rhel-server-releases)
               rpm = 4.8.0-12.el6
           Available: rpm-4.8.0-16.el6.i686 (rhui-ap-southeast-1-rhel-server-releases)
               rpm = 4.8.0-16.el6
           Available: rpm-4.8.0-16.el6_1.1.i686 (rhui-ap-southeast-1-rhel-server-releases)
               rpm = 4.8.0-16.el6_1.1
           Available: rpm-4.8.0-19.el6.i686 (rhui-ap-southeast-1-rhel-server-releases)
               rpm = 4.8.0-19.el6
           Available: rpm-4.8.0-19.el6_2.1.i686 (rhui-ap-southeast-1-rhel-server-releases)
               rpm = 4.8.0-19.el6_2.1
Error: Package: gcc-gfortran-4.4.6-3.el6.i686 (rhui-ap-southeast-1-rhel-server-releases)
           Requires: libgfortran = 4.4.6-3.el6
           Installed: libgfortran-4.4.6-4.el6.i686 (@koji-override-0/$releasever)
               libgfortran = 4.4.4-15.el6
               libgfortran = 4.4.6-4.el6
           Available: libgfortran-4.4.4-13.el6.i686 (rhui-ap-southeast-1-rhel-server-releases)
               libgfortran = 4.4.4-13.el6
           Available: libgfortran-4.4.5-6.el6.i686 (rhui-ap-southeast-1-rhel-server-releases)
               libgfortran = 4.4.5-6.el6
               libgfortran = 4.4.4-15.el6
           Available: libgfortran-4.4.6-3.el6.i686 (rhui-ap-southeast-1-rhel-server-releases)
               libgfortran = 4.4.6-3.el6
               libgfortran = 4.4.4-15.el6
Error: Package: gcc-c++-4.4.6-3.el6.i686 (rhui-ap-southeast-1-rhel-server-releases)
           Requires: libstdc++ = 4.4.6-3.el6
           Installed: libstdc++-4.4.6-4.el6.i686 (@koji-override-0/$releasever)
               libstdc++ = 4.4.4-15.el6
               libstdc++ = 4.4.6-4.el6
           Available: libstdc++-4.4.4-13.el6.i686 (rhui-ap-southeast-1-rhel-server-releases)
               libstdc++ = 4.4.4-13.el6
           Available: libstdc++-4.4.5-6.el6.i686 (rhui-ap-southeast-1-rhel-server-releases)
               libstdc++ = 4.4.5-6.el6
               libstdc++ = 4.4.4-15.el6
           Available: libstdc++-4.4.6-3.el6.i686 (rhui-ap-southeast-1-rhel-server-releases)
               libstdc++ = 4.4.6-3.el6
               libstdc++ = 4.4.4-15.el6
Error: Package: libstdc++-devel-4.4.6-3.el6.i686 (rhui-ap-southeast-1-rhel-server-releases)
           Requires: libstdc++(x86-32) = 4.4.6-3.el6
           Installed: libstdc++-4.4.6-4.el6.i686 (@koji-override-0/$releasever)
               libstdc++(x86-32) = 4.4.6-4.el6
           Available: libstdc++-4.4.4-13.el6.i686 (rhui-ap-southeast-1-rhel-server-releases)
               libstdc++(x86-32) = 4.4.4-13.el6
           Available: libstdc++-4.4.5-6.el6.i686 (rhui-ap-southeast-1-rhel-server-releases)
               libstdc++(x86-32) = 4.4.5-6.el6
           Available: libstdc++-4.4.6-3.el6.i686 (rhui-ap-southeast-1-rhel-server-releases)
               libstdc++(x86-32) = 4.4.6-3.el6
Error: Package: systemtap-1.6-5.el6_2.i686 (rhui-ap-southeast-1-rhel-server-releases)
           Requires: systemtap-runtime = 1.6-5.el6_2
           Installed: systemtap-runtime-1.7-5.el6.i686 (@koji-override-0/$releasever)
               systemtap-runtime = 1.7-5.el6
           Available: systemtap-runtime-1.2-9.el6.i686 (rhui-ap-southeast-1-rhel-server-releases)
               systemtap-runtime = 1.2-9.el6
           Available: systemtap-runtime-1.2-11.el6_0.i686 (rhui-ap-southeast-1-rhel-server-releases)
               systemtap-runtime = 1.2-11.el6_0
           Available: systemtap-runtime-1.4-6.el6.i686 (rhui-ap-southeast-1-rhel-server-releases)
               systemtap-runtime = 1.4-6.el6
           Available: systemtap-runtime-1.4-6.el6_1.1.i686 (rhui-ap-southeast-1-rhel-server-releases)
               systemtap-runtime = 1.4-6.el6_1.1
           Available: systemtap-runtime-1.4-6.el6_1.2.i686 (rhui-ap-southeast-1-rhel-server-releases)
               systemtap-runtime = 1.4-6.el6_1.2
Comment 3 mkovacik 2012-06-18 04:06:24 EDT
           Available: systemtap-runtime-1.4-6.el6_1.3.i686 (rhui-ap-southeast-1-rhel-server-releases)
               systemtap-runtime = 1.4-6.el6_1.3
           Available: systemtap-runtime-1.6-4.el6.i686 (rhui-ap-southeast-1-rhel-server-releases)
               systemtap-runtime = 1.6-4.el6
           Available: systemtap-runtime-1.6-5.el6_2.i686 (rhui-ap-southeast-1-rhel-server-releases)
               systemtap-runtime = 1.6-5.el6_2
Error: Package: gcc-4.4.6-3.el6.i686 (rhui-ap-southeast-1-rhel-server-releases)
           Requires: libgomp = 4.4.6-3.el6
           Installed: libgomp-4.4.6-4.el6.i686 (@koji-override-0/$releasever)
               libgomp = 4.4.4-15.el6
               libgomp = 4.4.6-4.el6
           Available: libgomp-4.4.4-13.el6.i686 (rhui-ap-southeast-1-rhel-server-releases)
               libgomp = 4.4.4-13.el6
           Available: libgomp-4.4.5-6.el6.i686 (rhui-ap-southeast-1-rhel-server-releases)
               libgomp = 4.4.5-6.el6
               libgomp = 4.4.4-15.el6
           Available: libgomp-4.4.6-3.el6.i686 (rhui-ap-southeast-1-rhel-server-releases)
               libgomp = 4.4.6-3.el6
               libgomp = 4.4.4-15.el6
RESULT: Loaded plugins: amazon-id, product-id, rhui-lb, security, subscription-manager
Updating certificate-based repositories.
Setting up Group Process
Package matching 1:make-3.81-19.el6.i686 already installed. Checking for update.
Package 1:pkgconfig-0.23-9.1.el6.i686 already installed and latest version
Package gettext-0.17-16.el6.i686 already installed and latest version
Package patch-2.6-6.el6.i686 already installed and latest version
Package matching binutils-2.20.51.0.2-5.28.el6.i686 already installed. Checking for update.
Package elfutils-0.152-1.el6.i686 already installed and latest version
Package cvs-1.11.23-11.el6_2.1.i686 already installed and latest version
Resolving Dependencies
--> Running transaction check
---> Package autoconf.noarch 0:2.63-5.1.el6 will be installed
---> Package automake.noarch 0:1.11.1-1.2.el6 will be installed
---> Package bison.i686 0:2.4.1-5.el6 will be installed
---> Package byacc.i686 0:1.9.20070509-6.1.el6 will be installed
---> Package cscope.i686 0:15.6-6.el6 will be installed
---> Package ctags.i686 0:5.8-2.el6 will be installed
---> Package diffstat.i686 0:1.51-2.el6 will be installed
---> Package doxygen.i686 1:1.6.1-6.el6 will be installed
---> Package flex.i686 0:2.5.35-8.el6 will be installed
---> Package gcc.i686 0:4.4.6-3.el6 will be installed
--> Processing Dependency: libgomp = 4.4.6-3.el6 for package: gcc-4.4.6-3.el6.i686
--> Processing Dependency: cpp = 4.4.6-3.el6 for package: gcc-4.4.6-3.el6.i686
--> Processing Dependency: glibc-devel >= 2.2.90-12 for package: gcc-4.4.6-3.el6.i686
--> Processing Dependency: cloog-ppl >= 0.15 for package: gcc-4.4.6-3.el6.i686
---> Package gcc-c++.i686 0:4.4.6-3.el6 will be installed
--> Processing Dependency: libstdc++-devel = 4.4.6-3.el6 for package: gcc-c++-4.4.6-3.el6.i686
--> Processing Dependency: libstdc++ = 4.4.6-3.el6 for package: gcc-c++-4.4.6-3.el6.i686
--> Processing Dependency: libmpfr.so.1 for package: gcc-c++-4.4.6-3.el6.i686
---> Package gcc-gfortran.i686 0:4.4.6-3.el6 will be installed
--> Processing Dependency: libgfortran = 4.4.6-3.el6 for package: gcc-gfortran-4.4.6-3.el6.i686
---> Package git.i686 0:1.7.1-2.el6_0.1 will be installed
--> Processing Dependency: perl-Git = 1.7.1-2.el6_0.1 for package: git-1.7.1-2.el6_0.1.i686
--> Processing Dependency: perl(Git) for package: git-1.7.1-2.el6_0.1.i686
--> Processing Dependency: perl(Error) for package: git-1.7.1-2.el6_0.1.i686
---> Package indent.i686 0:2.2.10-5.1.el6 will be installed
---> Package intltool.noarch 0:0.41.0-1.1.el6 will be installed
--> Processing Dependency: gettext-devel for package: intltool-0.41.0-1.1.el6.noarch
---> Package libtool.i686 0:2.2.6-15.5.el6 will be installed
---> Package patchutils.i686 0:0.3.1-3.1.el6 will be installed
---> Package rcs.i686 0:5.7-37.el6 will be installed
---> Package redhat-rpm-config.noarch 0:9.0.3-34.el6 will be installed
---> Package rpm-build.i686 0:4.8.0-19.el6_2.1 will be installed
--> Processing Dependency: rpm = 4.8.0-19.el6_2.1 for package: rpm-build-4.8.0-19.el6_2.1.i686
---> Package subversion.i686 0:1.6.11-2.el6_1.4 will be installed
--> Processing Dependency: apr >= 1.3.0 for package: subversion-1.6.11-2.el6_1.4.i686
--> Processing Dependency: libneon.so.27 for package: subversion-1.6.11-2.el6_1.4.i686
--> Processing Dependency: libaprutil-1.so.0 for package: subversion-1.6.11-2.el6_1.4.i686
--> Processing Dependency: libapr-1.so.0 for package: subversion-1.6.11-2.el6_1.4.i686
---> Package swig.i686 0:1.3.40-6.el6 will be installed
---> Package systemtap.i686 0:1.6-5.el6_2 will be installed
--> Processing Dependency: systemtap-runtime = 1.6-5.el6_2 for package: systemtap-1.6-5.el6_2.i686
--> Processing Dependency: kernel-devel for package: systemtap-1.6-5.el6_2.i686
--> Running transaction check
---> Package apr.i686 0:1.3.9-5.el6_2 will be installed
---> Package apr-util.i686 0:1.3.9-3.el6_0.1 will be installed
---> Package cloog-ppl.i686 0:0.15.7-1.2.el6 will be installed
--> Processing Dependency: libppl_c.so.2 for package: cloog-ppl-0.15.7-1.2.el6.i686
--> Processing Dependency: libppl.so.7 for package: cloog-ppl-0.15.7-1.2.el6.i686
---> Package cpp.i686 0:4.4.6-3.el6 will be installed
---> Package gcc.i686 0:4.4.6-3.el6 will be installed
--> Processing Dependency: libgomp = 4.4.6-3.el6 for package: gcc-4.4.6-3.el6.i686
---> Package gcc-c++.i686 0:4.4.6-3.el6 will be installed
--> Processing Dependency: libstdc++ = 4.4.6-3.el6 for package: gcc-c++-4.4.6-3.el6.i686
---> Package gcc-gfortran.i686 0:4.4.6-3.el6 will be installed
--> Processing Dependency: libgfortran = 4.4.6-3.el6 for package: gcc-gfortran-4.4.6-3.el6.i686
---> Package gettext-devel.i686 0:0.17-16.el6 will be installed
--> Processing Dependency: gettext-libs = 0.17-16.el6 for package: gettext-devel-0.17-16.el6.i686
--> Processing Dependency: libgettextpo.so.0 for package: gettext-devel-0.17-16.el6.i686
--> Processing Dependency: libgcj_bc.so.1 for package: gettext-devel-0.17-16.el6.i686
--> Processing Dependency: libasprintf.so.0 for package: gettext-devel-0.17-16.el6.i686
---> Package glibc-devel.i686 0:2.12-1.47.el6_2.12 will be installed
--> Processing Dependency: glibc-headers = 2.12-1.47.el6_2.12 for package: glibc-devel-2.12-1.47.el6_2.12.i686
--> Processing Dependency: glibc = 2.12-1.47.el6_2.12 for package: glibc-devel-2.12-1.47.el6_2.12.i686
--> Processing Dependency: glibc-headers for package: glibc-devel-2.12-1.47.el6_2.12.i686
---> Package kernel-devel.i686 0:2.6.32-220.17.1.el6 will be installed
---> Package libstdc++-devel.i686 0:4.4.6-3.el6 will be installed
--> Processing Dependency: libstdc++(x86-32) = 4.4.6-3.el6 for package: libstdc++-devel-4.4.6-3.el6.i686
---> Package mpfr.i686 0:2.4.1-6.el6 will be installed
---> Package neon.i686 0:0.29.3-1.2.el6 will be installed
--> Processing Dependency: libproxy.so.0 for package: neon-0.29.3-1.2.el6.i686
--> Processing Dependency: libpakchois.so.0 for package: neon-0.29.3-1.2.el6.i686
---> Package perl-Error.noarch 1:0.17015-4.el6 will be installed
---> Package perl-Git.noarch 0:1.7.1-2.el6_0.1 will be installed
---> Package rpm-build.i686 0:4.8.0-19.el6_2.1 will be installed
--> Processing Dependency: rpm = 4.8.0-19.el6_2.1 for package: rpm-build-4.8.0-19.el6_2.1.i686
---> Package systemtap.i686 0:1.6-5.el6_2 will be installed
--> Processing Dependency: systemtap-runtime = 1.6-5.el6_2 for package: systemtap-1.6-5.el6_2.i686
--> Running transaction check
---> Package gcc.i686 0:4.4.6-3.el6 will be installed
--> Processing Dependency: libgomp = 4.4.6-3.el6 for package: gcc-4.4.6-3.el6.i686
---> Package gcc-c++.i686 0:4.4.6-3.el6 will be installed
--> Processing Dependency: libstdc++ = 4.4.6-3.el6 for package: gcc-c++-4.4.6-3.el6.i686
---> Package gcc-gfortran.i686 0:4.4.6-3.el6 will be installed
--> Processing Dependency: libgfortran = 4.4.6-3.el6 for package: gcc-gfortran-4.4.6-3.el6.i686
---> Package gettext-libs.i686 0:0.17-16.el6 will be installed
---> Package glibc-devel.i686 0:2.12-1.47.el6_2.12 will be installed
--> Processing Dependency: glibc = 2.12-1.47.el6_2.12 for package: glibc-devel-2.12-1.47.el6_2.12.i686
---> Package glibc-headers.i686 0:2.12-1.47.el6_2.12 will be installed
--> Processing Dependency: glibc = 2.12-1.47.el6_2.12 for package: glibc-headers-2.12-1.47.el6_2.12.i686
--> Processing Dependency: kernel-headers >= 2.2.1 for package: glibc-headers-2.12-1.47.el6_2.12.i686
--> Processing Dependency: kernel-headers for package: glibc-headers-2.12-1.47.el6_2.12.i686
---> Package libgcj.i686 0:4.4.6-3.el6 will be installed
--> Processing Dependency: libart_lgpl >= 2.1.0 for package: libgcj-4.4.6-3.el6.i686
---> Package libproxy.i686 0:0.3.0-2.el6 will be installed
--> Processing Dependency: libproxy-python = 0.3.0-2.el6 for package: libproxy-0.3.0-2.el6.i686
--> Processing Dependency: libproxy-bin = 0.3.0-2.el6 for package: libproxy-0.3.0-2.el6.i686
---> Package libstdc++-devel.i686 0:4.4.6-3.el6 will be installed
--> Processing Dependency: libstdc++(x86-32) = 4.4.6-3.el6 for package: libstdc++-devel-4.4.6-3.el6.i686
---> Package pakchois.i686 0:0.4-3.2.el6 will be installed
---> Package ppl.i686 0:0.10.2-11.el6 will be installed
---> Package rpm-build.i686 0:4.8.0-19.el6_2.1 will be installed
--> Processing Dependency: rpm = 4.8.0-19.el6_2.1 for package: rpm-build-4.8.0-19.el6_2.1.i686
---> Package systemtap.i686 0:1.6-5.el6_2 will be installed
--> Processing Dependency: systemtap-runtime = 1.6-5.el6_2 for package: systemtap-1.6-5.el6_2.i686
--> Running transaction check
---> Package gcc.i686 0:4.4.6-3.el6 will be installed
--> Processing Dependency: libgomp = 4.4.6-3.el6 for package: gcc-4.4.6-3.el6.i686
---> Package gcc-c++.i686 0:4.4.6-3.el6 will be installed
--> Processing Dependency: libstdc++ = 4.4.6-3.el6 for package: gcc-c++-4.4.6-3.el6.i686
---> Package gcc-gfortran.i686 0:4.4.6-3.el6 will be installed
--> Processing Dependency: libgfortran = 4.4.6-3.el6 for package: gcc-gfortran-4.4.6-3.el6.i686
---> Package glibc-devel.i686 0:2.12-1.47.el6_2.12 will be installed
--> Processing Dependency: glibc = 2.12-1.47.el6_2.12 for package: glibc-devel-2.12-1.47.el6_2.12.i686
---> Package glibc-headers.i686 0:2.12-1.47.el6_2.12 will be installed
--> Processing Dependency: glibc = 2.12-1.47.el6_2.12 for package: glibc-headers-2.12-1.47.el6_2.12.i686
---> Package kernel-headers.i686 0:2.6.32-220.17.1.el6 will be installed
---> Package libart_lgpl.i686 0:2.3.20-5.1.el6 will be installed
---> Package libproxy-bin.i686 0:0.3.0-2.el6 will be installed
---> Package libproxy-python.i686 0:0.3.0-2.el6 will be installed
---> Package libstdc++-devel.i686 0:4.4.6-3.el6 will be installed
--> Processing Dependency: libstdc++(x86-32) = 4.4.6-3.el6 for package: libstdc++-devel-4.4.6-3.el6.i686
---> Package rpm-build.i686 0:4.8.0-19.el6_2.1 will be installed
--> Processing Dependency: rpm = 4.8.0-19.el6_2.1 for package: rpm-build-4.8.0-19.el6_2.1.i686
---> Package systemtap.i686 0:1.6-5.el6_2 will be installed
--> Processing Dependency: systemtap-runtime = 1.6-5.el6_2 for package: systemtap-1.6-5.el6_2.i686
--> Finished Dependency Resolution
 You could try using --skip-broken to work around the problem
 You could try running: rpm -Va --nofiles --nodigest 
EXPECTED RESULT: 
RETURN CODE: 1
FAIL1
Loaded plugins: amazon-id, product-id, rhui-lb, security, subscription-manager Updating certificate-based repositories. Setting up Group Process Package matching 1:make-3.81-19.el6.i686 already installed. Checking for update. Package 1:pkgconfig-0.23-9.1.el6.i686 already installed and latest version Package gettext-0.17-16.el6.i686 already installed and latest version Package patch-2.6-6.el6.i686 already installed and latest version Package matching binutils-2.20.51.0.2-5.28.el6.i686 already installed. Checking for update. Package elfutils-0.152-1.el6.i686 already installed and latest version Package cvs-1.11.23-11.el6_2.1.i686 already installed and latest version Resolving Dependencies --> Running transaction check ---> Package autoconf.noarch 0:2.63-5.1.el6 will be installed ---> Package automake.noarch 0:1.11.1-1.2.el6 will be installed ---> Package bison.i686 0:2.4.1-5.el6 will be installed ---> Package byacc.i686 0:1.9.20070509-6.1.el6 will be installed ---> Package cscope.i686 0:15.6-6.el6 will be installed ---> Package ctags.i686 0:5.8-2.el6 will be installed ---> Package diffstat.i686 0:1.51-2.el6 will be installed ---> Package doxygen.i686 1:1.6.1-6.el6 will be installed ---> Package flex.i686 0:2.5.35-8.el6 will be installed ---> Package gcc.i686 0:4.4.6-3.el6 will be installed --> Processing Dependency: libgomp = 4.4.6-3.el6 for package: gcc-4.4.6-3.el6.i686 --> Processing Dependency: cpp = 4.4.6-3.el6 for package: gcc-4.4.6-3.el6.i686 --> Processing Dependency: glibc-devel >= 2.2.90-12 for package: gcc-4.4.6-3.el6.i686 --> Processing Dependency: cloog-ppl >= 0.15 for package: gcc-4.4.6-3.el6.i686 ---> Package gcc-c++.i686 0:4.4.6-3.el6 will be installed --> Processing Dependency: libstdc++-devel = 4.4.6-3.el6 for package: gcc-c++-4.4.6-3.el6.i686 --> Processing Dependency: libstdc++ = 4.4.6-3.el6 for package: gcc-c++-4.4.6-3.el6.i686 --> Processing Dependency: libmpfr.so.1 for package: gcc-c++-4.4.6-3.el6.i686 ---> Package gcc-gfortran.i686 0:4.4.6-3.el6 will be installed --> Processing Dependency: libgfortran = 4.4.6-3.el6 for package: gcc-gfortran-4.4.6-3.el6.i686 ---> Package git.i686 0:1.7.1-2.el6_0.1 will be installed --> Processing Dependency: perl-Git = 1.7.1-2.el6_0.1 for package: git-1.7.1-2.el6_0.1.i686 --> Processing Dependency: perl(Git) for package: git-1.7.1-2.el6_0.1.i686 --> Processing Dependency: perl(Error) for package: git-1.7.1-2.el6_0.1.i686 ---> Package indent.i686 0:2.2.10-5.1.el6 will be installed ---> Package intltool.noarch 0:0.41.0-1.1.el6 will be installed --> Processing Dependency: gettext-devel for package: intltool-0.41.0-1.1.el6.noarch ---> Package libtool.i686 0:2.2.6-15.5.el6 will be installed ---> Package patchutils.i686 0:0.3.1-3.1.el6 will be installed ---> Package rcs.i686 0:5.7-37.el6 will be installed ---> Package redhat-rpm-config.noarch 0:9.0.3-34.el6 will be installed ---> Package rpm-build.i686 0:4.8.0-19.el6_2.1 will be installed --> Processing Dependency: rpm = 4.8.0-19.el6_2.1 for package: rpm-build-4.8.0-19.el6_2.1.i686 ---> Package subversion.i686 0:1.6.11-2.el6_1.4 will be installed --> Processing Dependency: apr >= 1.3.0 for package: subversion-1.6.11-2.el6_1.4.i686 --> Processing Dependency: libneon.so.27 for package: subversion-1.6.11-2.el6_1.4.i686 --> Processing Dependency: libaprutil-1.so.0 for package: subversion-1.6.11-2.el6_1.4.i686 --> Processing Dependency: libapr-1.so.0 for package: subversion-1.6.11-2.el6_1.4.i686 ---> Package swig.i686 0:1.3.40-6.el6 will be installed ---> Package systemtap.i686 0:1.6-5.el6_2 will be installed --> Processing Dependency: systemtap-runtime = 1.6-5.el6_2 for package: systemtap-1.6-5.el6_2.i686 --> Processing Dependency: kernel-devel for package: systemtap-1.6-5.el6_2.i686 --> Running transaction check ---> Package apr.i686 0:1.3.9-5.el6_2 will be installed ---> Package apr-util.i686 0:1.3.9-3.el6_0.1 will be installed ---> Package cloog-ppl.i686 0:0.15.7-1.2.el6 will be installed --> Processing Dependency: libppl_c.so.2 for package: cloog-ppl-0.15.7-1.2.el6.i686 --> Processing Dependency: libppl.so.7 for package: cloog-ppl-0.15.7-1.2.el6.i686 ---> Package cpp.i686 0:4.4.6-3.el6 will be installed ---> Package gcc.i686 0:4.4.6-3.el6 will be installed --> Processing Dependency: libgomp = 4.4.6-3.el6 for package: gcc-4.4.6-3.el6.i686 ---> Package gcc-c++.i686 0:4.4.6-3.el6 will be installed --> Processing Dependency: libstdc++ = 4.4.6-3.el6 for package: gcc-c++-4.4.6-3.el6.i686 ---> Package gcc-gfortran.i686 0:4.4.6-3.el6 will be installed --> Processing Dependency: libgfortran = 4.4.6-3.el6 for package: gcc-gfortran-4.4.6-3.el6.i686 ---> Package gettext-devel.i686 0:0.17-16.el6 will be installed --> Processing Dependency: gettext-libs = 0.17-16.el6 for package: gettext-devel-0.17-16.el6.i686 --> Processing Dependency: libgettextpo.so.0 for package: gettext-devel-0.17-16.el6.i686 --> Processing Dependency: libgcj_bc.so.1 for package: gettext-devel-0.17-16.el6.i686 --> Processing Dependency: libasprintf.so.0 for package: gettext-devel-0.17-16.el6.i686 ---> Package glibc-devel.i686 0:2.12-1.47.el6_2.12 will be installed --> Processing Dependency: glibc-headers = 2.12-1.47.el6_2.12 for package: glibc-devel-2.12-1.47.el6_2.12.i686 --> Processing Dependency: glibc = 2.12-1.47.el6_2.12 for package: glibc-devel-2.12-1.47.el6_2.12.i686 --> Processing Dependency: glibc-headers for package: glibc-devel-2.12-1.47.el6_2.12.i686 ---> Package kernel-devel.i686 0:2.6.32-220.17.1.el6 will be installed ---> Package libstdc++-devel.i686 0:4.4.6-3.el6 will be installed --> Processing Dependency: libstdc++(x86-32) = 4.4.6-3.el6 for package: libstdc++-devel-4.4.6-3.el6.i686 ---> Package mpfr.i686 0:2.4.1-6.el6 will be installed ---> Package neon.i686 0:0.29.3-1.2.el6 will be installed --> Processing Dependency: libproxy.so.0 for package: neon-0.29.3-1.2.el6.i686 --> Processing Dependency: libpakchois.so.0 for package: neon-0.29.3-1.2.el6.i686 ---> Package perl-Error.noarch 1:0.17015-4.el6 will be installed ---> Package perl-Git.noarch 0:1.7.1-2.el6_0.1 will be installed ---> Package rpm-build.i686 0:4.8.0-19.el6_2.1 will be installed --> Processing Dependency: rpm = 4.8.0-19.el6_2.1 for package: rpm-build-4.8.0-19.el6_2.1.i686 ---> Package systemtap.i686 0:1.6-5.el6_2 will be installed --> Processing Dependency: systemtap-runtime = 1.6-5.el6_2 for package: systemtap-1.6-5.el6_2.i686 --> Running transaction check ---> Package gcc.i686 0:4.4.6-3.el6 will be installed --> Processing Dependency: libgomp = 4.4.6-3.el6 for package: gcc-4.4.6-3.el6.i686 ---> Package gcc-c++.i686 0:4.4.6-3.el6 will be installed --> Processing Dependency: libstdc++ = 4.4.6-3.el6 for package: gcc-c++-4.4.6-3.el6.i686 ---> Package gcc-gfortran.i686 0:4.4.6-3.el6 will be installed --> Processing Dependency: libgfortran = 4.4.6-3.el6 for package: gcc-gfortran-4.4.6-3.el6.i686 ---> Package gettext-libs.i686 0:0.17-16.el6 will be installed ---> Package glibc-devel.i686 0:2.12-1.47.el6_2.12 will be installed --> Processing Dependency: glibc = 2.12-1.47.el6_2.12 for package: glibc-devel-2.12-1.47.el6_2.12.i686 ---> Package glibc-headers.i686 0:2.12-1.47.el6_2.12 will be installed --> Processing Dependency: glibc = 2.12-1.47.el6_2.12 for package: glibc-headers-2.12-1.47.el6_2.12.i686 --> Processing Dependency: kernel-headers >= 2.2.1 for package: glibc-headers-2.12-1.47.el6_2.12.i686 --> Processing Dependency: kernel-headers for package: glibc-headers-2.12-1.47.el6_2.12.i686 ---> Package libgcj.i686 0:4.4.6-3.el6 will be installed --> Processing Dependency: libart_lgpl >= 2.1.0 for package: libgcj-4.4.6-3.el6.i686 ---> Package libproxy.i686 0:0.3.0-2.el6 will be installed --> Processing Dependency: libproxy-python = 0.3.0-2.el6 for package: libproxy-0.3.0-2.el6.i686 --> Processing Dependency: libproxy-bin = 0.3.0-2.el6 for package: libproxy-0.3.0-2.el6.i686 ---> Package libstdc++-devel.i686 0:4.4.6-3.el6 will be installed --> Processing Dependency: libstdc++(x86-32) = 4.4.6-3.el6 for package: libstdc++-devel-4.4.6-3.el6.i686 ---> Package pakchois.i686 0:0.4-3.2.el6 will be installed ---> Package ppl.i686 0:0.10.2-11.el6 will be installed ---> Package rpm-build.i686 0:4.8.0-19.el6_2.1 will be installed --> Processing Dependency: rpm = 4.8.0-19.el6_2.1 for package: rpm-build-4.8.0-19.el6_2.1.i686 ---> Package systemtap.i686 0:1.6-5.el6_2 will be installed --> Processing Dependency: systemtap-runtime = 1.6-5.el6_2 for package: systemtap-1.6-5.el6_2.i686 --> Running transaction check ---> Package gcc.i686 0:4.4.6-3.el6 will be installed --> Processing Dependency: libgomp = 4.4.6-3.el6 for package: gcc-4.4.6-3.el6.i686 ---> Package gcc-c++.i686 0:4.4.6-3.el6 will be installed --> Processing Dependency: libstdc++ = 4.4.6-3.el6 for package: gcc-c++-4.4.6-3.el6.i686 ---> Package gcc-gfortran.i686 0:4.4.6-3.el6 will be installed --> Processing Dependency: libgfortran = 4.4.6-3.el6 for package: gcc-gfortran-4.4.6-3.el6.i686 ---> Package glibc-devel.i686 0:2.12-1.47.el6_2.12 will be installed --> Processing Dependency: glibc = 2.12-1.47.el6_2.12 for package: glibc-devel-2.12-1.47.el6_2.12.i686 ---> Package glibc-headers.i686 0:2.12-1.47.el6_2.12 will be installed --> Processing Dependency: glibc = 2.12-1.47.el6_2.12 for package: glibc-headers-2.12-1.47.el6_2.12.i686 ---> Package kernel-headers.i686 0:2.6.32-220.17.1.el6 will be installed ---> Package libart_lgpl.i686 0:2.3.20-5.1.el6 will be installed ---> Package libproxy-bin.i686 0:0.3.0-2.el6 will be installed ---> Package libproxy-python.i686 0:0.3.0-2.el6 will be installed ---> Package libstdc++-devel.i686 0:4.4.6-3.el6 will be installed --> Processing Dependency: libstdc++(x86-32) = 4.4.6-3.el6 for package: libstdc++-devel-4.4.6-3.el6.i686 ---> Package rpm-build.i686 0:4.8.0-19.el6_2.1 will be installed --> Processing Dependency: rpm = 4.8.0-19.el6_2.1 for package: rpm-build-4.8.0-19.el6_2.1.i686 ---> Package systemtap.i686 0:1.6-5.el6_2 will be installed --> Processing Dependency: systemtap-runtime = 1.6-5.el6_2 for package: systemtap-1.6-5.el6_2.i686 --> Finished Dependency Resolution You could try using --skip-broken to work around the problem You could try running: rpm -Va --nofiles --nodigest
# checking possible sys update
Loaded plugins: amazon-id, product-id, rhui-lb, security, subscription-manager
Updating certificate-based repositories.
# no sys update found
######################################################################################
# NEW TEST: ## Verify yum update ... 
######################################################################################
COMMAND:  /usr/bin/yum -y update
Unable to read consumer identity
RESULT: Loaded plugins: amazon-id, product-id, rhui-lb, security, subscription-manager
Updating certificate-based repositories.
Setting up Update Process
Resolving Dependencies
--> Running transaction check
---> Package dmidecode.i686 1:2.11-2.el6 will be updated
---> Package dmidecode.i686 1:2.11-2.el6_1 will be an update
---> Package java-1.6.0-openjdk.i686 1:1.6.0.0-1.45.1.11.1.el6 will be updated
---> Package java-1.6.0-openjdk.i686 1:1.6.0.0-1.48.1.11.3.el6_2 will be an update
---> Package perl-Compress-Raw-Bzip2.i686 0:2.020-127.el6 will be updated
---> Package perl-Compress-Raw-Bzip2.i686 0:2.027-1.el6 will be an update
--> Finished Dependency Resolution

Dependencies Resolved

================================================================================
 Package    Arch Version         Repository                                Size
================================================================================
Updating:
 dmidecode  i686 1:2.11-2.el6_1  rhui-ap-southeast-1-rhel-server-releases  70 k
 java-1.6.0-openjdk
            i686 1:1.6.0.0-1.48.1.11.3.el6_2
                                 rhui-ap-southeast-1-rhel-server-releases  26 M
 perl-Compress-Raw-Bzip2
            i686 2.027-1.el6     epel                                      30 k

Transaction Summary
================================================================================
Upgrade       3 Package(s)

Total download size: 26 M
Downloading Packages:
--------------------------------------------------------------------------------
Total                                            16 MB/s |  26 MB     00:01     
Running rpm_check_debug
Running Transaction Test
Transaction Test Succeeded
Running Transaction

  Updating   : perl-Compress-Raw-Bzip2-2.027-1.el6.i686                     1/6 

  Updating   : 1:dmidecode-2.11-2.el6_1.i686                                2/6 

  Updating   : 1:java-1.6.0-openjdk-1.6.0.0-1.48.1.11.3.el6_2.i686          3/6 

  Cleanup    : 1:dmidecode-2.11-2.el6.i686                                  4/6 

  Cleanup    : perl-Compress-Raw-Bzip2-2.020-127.el6.i686                   5/6 

  Cleanup    : 1:java-1.6.0-openjdk-1.6.0.0-1.45.1.11.1.el6.i686            6/6 
Installed products updated.

  Verifying  : 1:java-1.6.0-openjdk-1.6.0.0-1.48.1.11.3.el6_2.i686          1/6 

  Verifying  : perl-Compress-Raw-Bzip2-2.027-1.el6.i686                     2/6 

  Verifying  : 1:dmidecode-2.11-2.el6_1.i686                                3/6 

  Verifying  : 1:dmidecode-2.11-2.el6.i686                                  4/6 

  Verifying  : 1:java-1.6.0-openjdk-1.6.0.0-1.45.1.11.1.el6.i686            5/6 

  Verifying  : perl-Compress-Raw-Bzip2-2.020-127.el6.i686                   6/6 

Updated:
  dmidecode.i686 1:2.11-2.el6_1                                                 
  java-1.6.0-openjdk.i686 1:1.6.0.0-1.48.1.11.3.el6_2                           
  perl-Compress-Raw-Bzip2.i686 0:2.027-1.el6                                    

Complete! 
EXPECTED RESULT: 
RETURN CODE: 0
PASS
######################################################################################
# NEW TEST: ## Verify no fa1lures in rpm package ... 
######################################################################################
COMMAND:  cat /root/valid/src/validate.log | grep 'failure in rpm package' | wc -l
RESULT: 1 
EXPECTED RESULT: 1
RETURN CODE: 0
PASS
######################################################################################
# NEW TEST: ## Verify no rpm scriplet fa1lures ... 
######################################################################################
COMMAND:  cat /root/valid/src/validate.log | grep 'scriptlet failed, exit status 1' | wc -l
RESULT: 1 
EXPECTED RESULT: 1
RETURN CODE: 0
PASS
######################################################################################
# NEW TEST: ## Verify package removal... 
######################################################################################
COMMAND: /bin/rpm -e zsh
RETURN CODE: 0
COMMAND:  /bin/rpm -q zsh
RESULT: package zsh is not installed 
EXPECTED RESULT: package zsh is not installed
RETURN CODE: 1
PASS
######################################################################################
# NEW TEST: ## install zsh ... 
######################################################################################
COMMAND: /usr/bin/yum -y install zsh
Unable to read consumer identity
Warning: RPMDB altered outside of yum.
RETURN CODE: 0
COMMAND:  /bin/rpm -q --queryformat '%{NAME}\n' zsh
RESULT: zsh 
EXPECTED RESULT: zsh
RETURN CODE: 0
PASS
######################################################################################
# NEW TEST: ## Verify package removal ... 
######################################################################################
COMMAND: /bin/rpm -e zsh
RETURN CODE: 0
COMMAND:  /bin/rpm -q zsh
RESULT: package zsh is not installed 
EXPECTED RESULT: package zsh is not installed
RETURN CODE: 1
PASS
# checking possible sys update
Loaded plugins: amazon-id, product-id, rhui-lb, security, subscription-manager
Updating certificate-based repositories.
# no sys update found
######################################################################################
# NEW TEST: ## Verify yum update ... 
######################################################################################
COMMAND:  /usr/bin/yum -y update
Unable to read consumer identity
RESULT: Loaded plugins: amazon-id, product-id, rhui-lb, security, subscription-manager
Updating certificate-based repositories.
Setting up Update Process
No Packages marked for Update 
EXPECTED RESULT: 
RETURN CODE: 0
PASS
######################################################################################
# NEW TEST: ## Verify disabled yum plugin ... 
######################################################################################
COMMAND:  grep ^enabled /etc/yum/pluginconf.d/rhnplugin.conf | grep -v '^#' | cut -d\= -f2 | awk '{print }' | sort -f | uniq
RESULT:  0 
EXPECTED RESULT: 
RETURN CODE: 0
PASS

## Summary ##
FAILURES = 1
FAILED TESTS = ## Install Development tools group...
LOG FILE = /root/valid/src/validate.log
## Summary ##

######################################################################################
# NEW TEST: ## Open a bugzilla
######################################################################################
Comment 4 mkovacik 2012-06-18 04:13:03 EDT
IMAGE ID= 
Preparing...                ##################################################
epel-release                ##################################################
Loaded plugins: amazon-id, product-id, rhui-lb, security, subscription-manager
Updating certificate-based repositories.
Setting up Install Process
Resolving Dependencies
--> Running transaction check
---> Package python-bugzilla.noarch 0:0.6.0-1.el6 will be installed
--> Finished Dependency Resolution

Dependencies Resolved

================================================================================
 Package                 Arch           Version              Repository    Size
================================================================================
Installing:
 python-bugzilla         noarch         0.6.0-1.el6          epel          71 k

Transaction Summary
================================================================================
Install       1 Package(s)

Total download size: 71 k
Installed size: 309 k
Downloading Packages:
Retrieving key from file:///etc/pki/rpm-gpg/RPM-GPG-KEY-EPEL-6
Running rpm_check_debug
Running Transaction Test
Transaction Test Succeeded
Running Transaction

  Installing : python-bugzilla-0.6.0-1.el6.noarch                           1/1 
Installed products updated.

  Verifying  : python-bugzilla-0.6.0-1.el6.noarch                           1/1 

Installed:
  python-bugzilla.noarch 0:0.6.0-1.el6                                          

Complete!
=====image_validation.sh Mon Jun 18 04:09:22 EDT 2012=====
######################################################################################
# NEW TEST: ## Open a bugzilla
######################################################################################
######################################################################################
# NEW TEST: Fetching the identity doc Details
######################################################################################
Verifying that signature exists
COMMAND:  echo 1
RESULT: 1 
EXPECTED RESULT: 1
RETURN CODE: 0
PASS
Verifying the IMAGE ID
COMMAND:  echo 1
RESULT: 1 
EXPECTED RESULT: 1
RETURN CODE: 0
PASS
Verifying the Architecture
COMMAND:  echo 1
RESULT: 1 
EXPECTED RESULT: 1
RETURN CODE: 0
PASS
This Host => ec2-46-137-200-196.ap-southeast-1.compute.amazonaws.com with Image Id : ami-28d6907a, is launched with Instance Id : i-6a0d9d3e , Instance Type : m1.small and Arch : i386 in the Region : ap-southeast-1b
The Validate Signature is : UMvTIzeUR/UQHI4WSINiIyC7yLnN/yVJg1KDk/YMOp5qfQjFl1Vm7krpFAek3MhrDHBDbuT51mh5
yw0jsvtBi7fpCChohGARx+MvxflXZXy4KFlFYqnNdZh7+ZgM1vOHJW5Hh7zHOXaoCguhDqG95r+5
jBnIHcyIydRcQom5gM4=
This is a Cloud Access image
/root/valid/src
ip-10-136-131-6
Red Hat Enterprise Linux Server release 6.3 (Santiago)
######################################################################################
# NEW TEST: The selected image has the version RHEL 6.3
######################################################################################
######################################################################################
# NEW TEST: ## Verify auditd is on ... 
######################################################################################
COMMAND:  /sbin/chkconfig --list auditd | grep 3:on
RESULT: auditd         	0:off	1:off	2:on	3:on	4:on	5:on	6:off 
EXPECTED RESULT: 
RETURN CODE: 0
PASS
COMMAND:  /sbin/chkconfig --list auditd | grep 5:on
RESULT: auditd         	0:off	1:off	2:on	3:on	4:on	5:on	6:off 
EXPECTED RESULT: 
RETURN CODE: 0
PASS
######################################################################################
# NEW TEST: ## Verify audit.rules ... 
######################################################################################
COMMAND:  md5sum /etc/audit/audit.rules | cut -f 1 -d  " "
RESULT: f9869e1191838c461f5b9051c78a638d 
EXPECTED RESULT: f9869e1191838c461f5b9051c78a638d
RETURN CODE: 0
PASS
######################################################################################
# NEW TEST: ## Verify auditd.conf ... 
######################################################################################
COMMAND:  md5sum /etc/audit/auditd.conf | cut -f 1 -d  " "
RESULT: e1886162554c18906df2ecd258aa4794 
EXPECTED RESULT: e1886162554c18906df2ecd258aa4794
RETURN CODE: 0
PASS
######################################################################################
# NEW TEST: ## Verify auditd sysconfig ... 
######################################################################################
COMMAND:  md5sum /etc/sysconfig/auditd | cut -f 1 -d  " "
RESULT: d4d43637708e30418c30003e212f76fc 
EXPECTED RESULT: d4d43637708e30418c30003e212f76fc
RETURN CODE: 0
PASS
######################################################################################
# NEW TEST: ## Verify bash_history ... 
######################################################################################
COMMAND:  cat ~/.bash_history | wc -l 
cat: /root/.bash_history: No such file or directory
RESULT: 0 
EXPECTED RESULT: 0
RETURN CODE: 0
PASS
######################################################################################
# NEW TEST: ## Verify  chkconfig ... 
######################################################################################
COMMAND:  chkconfig --list | grep crond | cut -f 5
RESULT: 3:on 
EXPECTED RESULT: 3:on
RETURN CODE: 0
PASS
COMMAND:  chkconfig --list | grep  iptables | cut -f 5
RESULT: 3:on 
EXPECTED RESULT: 3:on
RETURN CODE: 0
PASS
######################################################################################
# NEW TEST: ## Verify rh-cloud-firstboot is OFF ... 
######################################################################################
COMMAND:  chkconfig --list | grep rh-cloud | grep 3:off | wc -l
RESULT: 1 
EXPECTED RESULT: 1
RETURN CODE: 0
PASS
/etc/sysconfig/rh-cloud-firstboot FOUND
COMMAND:  echo true
RESULT: true 
EXPECTED RESULT: 
RETURN CODE: 0
PASS
COMMAND:  cat /etc/sysconfig/rh-cloud-firstboot
RESULT: RUN_FIRSTBOOT=NO 
EXPECTED RESULT: RUN_FIRSTBOOT=NO
RETURN CODE: 0
PASS
######################################################################################
# NEW TEST: ## Partition Format  ...
######################################################################################
mount | grep /dev/xvde1 | awk '{ print  }'
COMMAND:  echo ext4
RESULT: ext4 
EXPECTED RESULT: ext4
RETURN CODE: 0
PASS
######################################################################################
# NEW TEST: ## Partition Size ...
######################################################################################
size=5905712
COMMAND:  echo true
RESULT: true 
EXPECTED RESULT: true
RETURN CODE: 0
PASS
######################################################################################
# NEW TEST: Fetching the identity doc Details
######################################################################################
Verifying that signature exists
COMMAND:  echo 1
RESULT: 1 
EXPECTED RESULT: 1
RETURN CODE: 0
PASS
Verifying the IMAGE ID
COMMAND:  echo 1
RESULT: 1 
EXPECTED RESULT: 1
RETURN CODE: 0
PASS
Verifying the Architecture
COMMAND:  echo 1
RESULT: 1 
EXPECTED RESULT: 1
RETURN CODE: 0
PASS
This Host => ec2-46-137-200-196.ap-southeast-1.compute.amazonaws.com with Image Id : ami-28d6907a, is launched with Instance Id : i-6a0d9d3e , Instance Type : m1.small and Arch : i386 in the Region : ap-southeast-1b
The Validate Signature is : UMvTIzeUR/UQHI4WSINiIyC7yLnN/yVJg1KDk/YMOp5qfQjFl1Vm7krpFAek3MhrDHBDbuT51mh5
yw0jsvtBi7fpCChohGARx+MvxflXZXy4KFlFYqnNdZh7+ZgM1vOHJW5Hh7zHOXaoCguhDqG95r+5
jBnIHcyIydRcQom5gM4=
This is a Cloud Access image
######################################################################################
# NEW TEST: ## Verify GPG checking ... 
######################################################################################
COMMAND:  grep '^gpgcheck=1' /etc/yum.repos.d/redhat-*.repo | cut -d\= -f2 | sort -f | uniq
RESULT: 1 
EXPECTED RESULT: 1
RETURN CODE: 0
PASS
######################################################################################
# NEW TEST: ## Verify GPG RPMS ... 
######################################################################################
COMMAND:  rpm -qa gpg-pubkey* | grep -o -F gpg-pubkey-2fa658e0-45700c69
RESULT: gpg-pubkey-2fa658e0-45700c69 
EXPECTED RESULT: gpg-pubkey-2fa658e0-45700c69
RETURN CODE: 0
PASS
COMMAND:  rpm -qa gpg-pubkey* | grep -o -F gpg-pubkey-fd431d51-4ae0493b
RESULT: gpg-pubkey-fd431d51-4ae0493b 
EXPECTED RESULT: gpg-pubkey-fd431d51-4ae0493b
RETURN CODE: 0
PASS
######################################################################################
# NEW TEST: ## Verify group file ... 
######################################################################################
COMMAND:  cat /etc/group | grep root:x:0
RESULT: root:x:0: 
EXPECTED RESULT: root:x:0:
RETURN CODE: 0
PASS
COMMAND:  cat /etc/group | grep daemon:x:2
RESULT: daemon:x:2:bin,daemon 
EXPECTED RESULT: daemon:x:2:bin,daemon
RETURN CODE: 0
PASS
COMMAND:  cat /etc/group | grep bin:x:1
RESULT: bin:x:1:bin,daemon 
EXPECTED RESULT: bin:x:1:bin,daemon
RETURN CODE: 0
PASS
COMMAND:  cat /etc/group | grep nobody:x:99
RESULT: nobody:x:99: 
EXPECTED RESULT: nobody:x:99:
RETURN CODE: 0
PASS
######################################################################################
# NEW TEST: ##test menu.lst ... 
######################################################################################
COMMAND:  file /boot/grub/menu.lst  | grep symbolic | wc -l
RESULT: 1 
EXPECTED RESULT: 1
RETURN CODE: 0
PASS
COMMAND:  file /boot/grub/menu.lst  | grep grub.conf | wc -l
RESULT: 1 
EXPECTED RESULT: 1
RETURN CODE: 0
PASS
COMMAND:  cat /boot/grub/grub.conf  | grep "(hd0,0)" | wc -l
RESULT: 0 
EXPECTED RESULT: 0
RETURN CODE: 0
PASS
######################################################################################
# NEW TEST: ## Verify runlevel ... 
######################################################################################
COMMAND:  cat /etc/inittab | grep id:
RESULT: id:3:initdefault: 
EXPECTED RESULT: id:3:initdefault:
RETURN CODE: 0
PASS
######################################################################################
# NEW TEST: ## Verify iptables ... 
######################################################################################
COMMAND: /etc/init.d/iptables status | grep REJECT 
5    REJECT     all  --  0.0.0.0/0            0.0.0.0/0           reject-with icmp-host-prohibited 
1    REJECT     all  --  0.0.0.0/0            0.0.0.0/0           reject-with icmp-host-prohibited 
RETURN CODE: 0
COMMAND:  /etc/init.d/iptables status | grep :22 | grep ACCEPT | wc -l 
RESULT: 1 
EXPECTED RESULT: 1
RETURN CODE: 0
PASS
######################################################################################
# NEW TEST: ## Verify /etc/ld.so.conf.d/libc6-xen.conf is not present ... 
######################################################################################
COMMAND:  ls /etc/ld.so.conf.d/libc6-xen.conf
ls: cannot access /etc/ld.so.conf.d/libc6-xen.conf: No such file or directory
RESULT:  
EXPECTED RESULT: 2
RETURN CODE: 2
PASS
######################################################################################
# NEW TEST: ##Verify memory match hwp ... 
######################################################################################
cat /proc/meminfo | grep MemTotal: | awk '{print }'
FOUND MEMORY OF 1711852 > hwp MEMORY of 1700000
COMMAND:  echo true
RESULT: true 
EXPECTED RESULT: 
RETURN CODE: 0
PASS
######################################################################################
# NEW TEST: ## Verify nameserver ... 
######################################################################################
COMMAND:  /usr/bin/dig clock.redhat.com 2>> /root/valid/src/validate.log | grep 66.187.233.4  | wc -l
RESULT: 1 
EXPECTED RESULT: 
RETURN CODE: 0
PASS
######################################################################################
# NEW TEST: ## Verify networking ... 
######################################################################################
COMMAND:  grep ^NETWORKING= /etc/sysconfig/network | cut -d\= -f2
RESULT: yes 
EXPECTED RESULT: yes
RETURN CODE: 0
PASS
######################################################################################
# NEW TEST: ## Verify device ... 
######################################################################################
COMMAND:  grep ^DEVICE= /etc/sysconfig/network-scripts/ifcfg-eth0 | cut -d\= -f2
RESULT: eth0 
EXPECTED RESULT: eth0
RETURN CODE: 0
PASS
######################################################################################
# NEW TEST: ## Verify no missing packages ... 
######################################################################################
COMMAND: /bin/rpm -qa --queryformat='%{NAME}\n' > /tmp/rpmqa.tmp
RETURN CODE: 0
COMMAND: comm -23 packages_63 /tmp/rpmqa
RETURN CODE: 0
COUNT = 0
COMMAND:  echo test passed
RESULT: test passed 
EXPECTED RESULT: 0
RETURN CODE: 0
PASS
######################################################################################
# NEW TEST: ## Verify new passwd file ... 
######################################################################################
COMMAND:  cat /etc/passwd | grep root:x:0
RESULT: root:x:0:0:root:/root:/bin/bash 
EXPECTED RESULT: root:x:0:0:root:/root:/bin/bash
RETURN CODE: 0
PASS
COMMAND:  cat /etc/passwd | grep nobody:x:99
RESULT: nobody:x:99:99:Nobody:/:/sbin/nologin 
EXPECTED RESULT: nobody:x:99:99:Nobody:/:/sbin/nologin
RETURN CODE: 0
PASS
COMMAND:  cat /etc/passwd | grep sshd
RESULT: sshd:x:74:74:Privilege-separated SSH:/var/empty/sshd:/sbin/nologin 
EXPECTED RESULT: sshd:x:74:74:Privilege-separated SSH:/var/empty/sshd:/sbin/nologin
RETURN CODE: 0
PASS
######################################################################################
# NEW TEST: ## test repo files ... 
######################################################################################
COMMAND:  ls -I 'epel*'  /etc/yum.repos.d/ | wc -l 
RESULT: 4 
EXPECTED RESULT: 4
RETURN CODE: 0
PASS
COMMAND:  ls /etc/yum.repos.d/redhat* | wc -l
RESULT: 2 
EXPECTED RESULT: 2
RETURN CODE: 0
PASS
COMMAND:  ls /etc/yum.repos.d/rhel* | wc -l
RESULT: 1 
EXPECTED RESULT: 0
RETURN CODE: 0
PASS
######################################################################################
# NEW TEST: ## Verify resize2fs ... 
######################################################################################
COMMAND: resize2fs -p /dev/xvde1 15000M
resize2fs 1.41.12 (17-May-2010)
RETURN CODE: 0
COMMAND:  df -h | grep 15G | wc -l 
RESULT: 1 
EXPECTED RESULT: 1
RETURN CODE: 0
PASS
/root/valid/src
ip-10-136-131-6
Red Hat Enterprise Linux Server release 6.3 (Santiago)
######################################################################################
# NEW TEST: The selected image has the version RHEL 6.3
######################################################################################
######################################################################################
# NEW TEST: ## /sbin/getenforce ... 
######################################################################################
COMMAND:  /usr/sbin/getenforce
RESULT: Enforcing 
EXPECTED RESULT: Enforcing
RETURN CODE: 0
PASS
######################################################################################
# NEW TEST: ## Verify SELINUX enforcing ... 
######################################################################################
COMMAND:  grep ^SELINUX= /etc/sysconfig/selinux | cut -d\= -f2
RESULT: enforcing 
EXPECTED RESULT: enforcing
RETURN CODE: 0
PASS
######################################################################################
# NEW TEST: ## Verify SELINUXTYPE targeted ... 
######################################################################################
COMMAND:  grep ^SELINUXTYPE= /etc/sysconfig/selinux | cut -d\= -f2
RESULT: targeted 
EXPECTED RESULT: targeted
RETURN CODE: 0
PASS
######################################################################################
# NEW TEST: ## Flip Selinux Permissive ... 
######################################################################################
COMMAND:  /usr/sbin/setenforce Permissive && /usr/sbin/getenforce
RESULT: Permissive 
EXPECTED RESULT: Permissive
RETURN CODE: 0
PASS
######################################################################################
# NEW TEST: ## Flip Selinux Enforcing ... 
######################################################################################
COMMAND:  /usr/sbin/setenforce Enforcing && /usr/sbin/getenforce
RESULT: Enforcing 
EXPECTED RESULT: Enforcing
RETURN CODE: 0
PASS
######################################################################################
# NEW TEST: ## Verify new shells file ... 
######################################################################################
COMMAND:  cat /etc/shells | grep bash
RESULT: /bin/bash 
EXPECTED RESULT: /bin/bash
RETURN CODE: 0
PASS
COMMAND:  cat /etc/shells | grep nologin
RESULT: /sbin/nologin 
EXPECTED RESULT: /sbin/nologin
RETURN CODE: 0
PASS
######################################################################################
# NEW TEST: ## Verify sshd_config settings ...
######################################################################################
COMMAND:  cat /etc/ssh/sshd_config  | grep  PasswordAuthentication | grep no | wc -l
RESULT: 1 
EXPECTED RESULT: 1
RETURN CODE: 0
PASS
######################################################################################
# NEW TEST: ## Verify sshd ...
######################################################################################
COMMAND:  chkconfig --list | grep sshd
RESULT: sshd           	0:off	1:off	2:on	3:on	4:on	5:on	6:off 
EXPECTED RESULT: sshd           	0:off	1:off	2:on	3:on	4:on	5:on	6:off
RETURN CODE: 0
PASS
COMMAND:  /etc/init.d/sshd status | grep running | wc -l
RESULT: 1 
EXPECTED RESULT: 1
RETURN CODE: 0
PASS
######################################################################################
# NEW TEST: ## Verify swap size ... 
######################################################################################
parted -l | grep linux-swap | awk '{print $4}' | awk -F'MB' '{print $1}'
swap size = 940
COMMAND:  test 940 -gt 0
RESULT:  
EXPECTED RESULT: 
RETURN CODE: 0
PASS
######################################################################################
# NEW TEST: ## Verify turning on/off swap file ... 
######################################################################################
COMMAND:  /sbin/swapoff /dev/xvde3 && /sbin/swapon /dev/xvde3
RESULT:  
EXPECTED RESULT: 
RETURN CODE: 0
PASS
######################################################################################
# NEW TEST: ## Verify rsyslog is on ... 
######################################################################################
COMMAND:  chkconfig --list | grep rsyslog | cut -f 5
RESULT: 3:on 
EXPECTED RESULT: 3:on
RETURN CODE: 0
PASS
######################################################################################
# NEW TEST: ## Verify rsyslog config ... 
######################################################################################
COMMAND:  md5sum /etc/rsyslog.conf | cut -f 1 -d  " "
RESULT: 8b91b32300134e98ef4aee632ed61e21 
EXPECTED RESULT: 8b91b32300134e98ef4aee632ed61e21
RETURN CODE: 0
PASS
######################################################################################
# NEW TEST: ## Verify no systemid file ... 
######################################################################################
COMMAND:  echo true
Comment 5 mkovacik 2012-06-18 04:13:12 EDT
RESULT: true 
EXPECTED RESULT: 
RETURN CODE: 0
PASS
######################################################################################
# NEW TEST: ## Verify kernel name ... 
######################################################################################
COMMAND:  /bin/uname -s
RESULT: Linux 
EXPECTED RESULT: Linux
RETURN CODE: 0
PASS
######################################################################################
# NEW TEST: ## Verify latest installed kernel is running ... 
######################################################################################
Detected rpm kernel version: 2.6.32-276.el6.i686
Detected uname kernel version: 2.6.32-276.el6.i686
COMMAND:  true
RESULT:  
EXPECTED RESULT: 
RETURN CODE: 0
PASS
######################################################################################
# NEW TEST: ## Verify latest kenerl is in /boot/grub/menu.1st ... 
######################################################################################
COMMAND:  cat /boot/grub/menu.lst | grep 2.6.32-276.el6.i686
RESULT: title RHEL6.3-20120531.0-Server-i386-starter-ec2 (2.6.32-276.el6.i686)
        kernel /boot/vmlinuz-2.6.32-276.el6.i686 ro root=LABEL=_/ 
        initrd /boot/initramfs-2.6.32-276.el6.i686.img 
EXPECTED RESULT: 
RETURN CODE: 0
PASS
######################################################################################
# NEW TEST: ## Verify operating system ... 
######################################################################################
COMMAND:  /bin/uname -o
RESULT: GNU/Linux 
EXPECTED RESULT: GNU/Linux
RETURN CODE: 0
PASS
######################################################################################
# NEW TEST: ## Verify /etc/sysconfig/kernel ... 
######################################################################################
COMMAND:  ls /etc/sysconfig/kernel
RESULT: /etc/sysconfig/kernel 
EXPECTED RESULT: 
RETURN CODE: 0
PASS
######################################################################################
# NEW TEST: ## Verify /etc/sysconfig/kernel contains UPDATEDEFAULT ... 
######################################################################################
COMMAND:  cat /etc/sysconfig/kernel | grep UPDATEDEFAULT=yes
RESULT: UPDATEDEFAULT=yes 
EXPECTED RESULT: 
RETURN CODE: 0
PASS
######################################################################################
# NEW TEST: ## Verify /etc/sysconfig/kernel contains DEFAULTKERNEL ... 
######################################################################################
COMMAND:  cat /etc/sysconfig/kernel | grep DEFAULTKERNEL=kernel
RESULT: DEFAULTKERNEL=kernel 
EXPECTED RESULT: 
RETURN CODE: 0
PASS
######################################################################################
# NEW TEST: ## Verify system up to date
######################################################################################
COMMAND:  _check_sys_update_phase1
# no update was required
RESULT: # checking sys update done
# no update was required 
EXPECTED RESULT: 
RETURN CODE: 0
PASS
######################################################################################
# NEW TEST: ## Verify RPMs ... 
######################################################################################
....L....  c /etc/pam.d/fingerprint-auth
....L....  c /etc/pam.d/password-auth
....L....  c /etc/pam.d/smartcard-auth
....L....  c /etc/pam.d/system-auth
.M.......    /var/cache/yum
    S file Size differs
    M Mode differs (includes permissions and file type)
    5 MD5 sum differs
    D Device major/minor number mismatch
    L readLink(2) path mismatch
    U User ownership differs
    G Group ownership differs
    T mTime differs

COMMAND:  cat /tmp/rpmqaV.txt | wc -l
RESULT: 5 
EXPECTED RESULT: 5
RETURN CODE: 0
PASS
######################################################################################
# NEW TEST: ## Verify Version 2 ... 
######################################################################################
COMMAND:  /bin/rpm -q --queryformat '%{RELEASE}\n' redhat-release-server | cut -d. -f1,2
RESULT: 6.3 
EXPECTED RESULT: 6.3
RETURN CODE: 0
PASS
######################################################################################
# NEW TEST: ## Verify packager ... 
######################################################################################
COMMAND:  cat /tmp/Packager | grep -v 'Red Hat, Inc.' |  grep -v crash-trace-commandPackager| wc -l
RESULT: 2 
EXPECTED RESULT: 0
RETURN CODE: 0
PASS
crash-trace-commandPackager    : Lai Jiangshan <laijs@cn.fujitsu.com>
epel-releasePackager    : Fedora Project
python-bugzillaPackager    : Fedora Project
######################################################################################
# NEW TEST: ## List the configured repositories...
######################################################################################
COMMAND:  /usr/bin/yum repolist
Unable to read consumer identity
RESULT: Loaded plugins: amazon-id, product-id, rhui-lb, security, subscription-manager
Updating certificate-based repositories.
repo id                                           repo name               status
epel                                              Extra Packages for Ente 6,111
rhui-ap-southeast-1-client-config-server-6        Red Hat Update Infrastr     1
rhui-ap-southeast-1-rhel-server-releases          Red Hat Enterprise Linu 5,587
rhui-ap-southeast-1-rhel-server-releases-optional Red Hat Enterprise Linu 3,344
repolist: 15,043 
EXPECTED RESULT: 
RETURN CODE: 0
PASS
######################################################################################
# NEW TEST: ## Search zsh...
######################################################################################
COMMAND:  /usr/bin/yum search zsh
Unable to read consumer identity
RESULT: Loaded plugins: amazon-id, product-id, rhui-lb, security, subscription-manager
Updating certificate-based repositories.
=============================== N/S Matched: zsh ===============================
autojump-zsh.noarch : Autojump for zsh
gromacs-zsh.noarch : GROMACS zsh support
python-twisted-core-zsh.i686 : Tab completion for Zsh and Twisted Core
zsh-html.i686 : Zsh shell manual in html format
zsh.i686 : A powerful interactive shell

  Name and summary matches only, use "search all" for everything. 
EXPECTED RESULT: 
RETURN CODE: 0
PASS
######################################################################################
# NEW TEST: ## install zsh ... 
######################################################################################
COMMAND: /usr/bin/yum -y install zsh
Unable to read consumer identity
RETURN CODE: 0
COMMAND:  /bin/rpm -q --queryformat '%{NAME}\n' zsh
RESULT: zsh 
EXPECTED RESULT: zsh
RETURN CODE: 0
PASS
######################################################################################
# NEW TEST: ## List available groups..
######################################################################################
COMMAND:  /usr/bin/yum grouplist
Unable to read consumer identity
RESULT: Loaded plugins: amazon-id, product-id, rhui-lb, security, subscription-manager
Updating certificate-based repositories.
Setting up Group Process
Installed Groups:
   Additional Development
   Base
   Client management tools
   Console internet tools
   Debugging Tools
   Desktop Platform
   Directory Client
   E-mail server
   Fonts
   Graphical Administration Tools
   Hardware monitoring utilities
   Java Platform
   Large Systems Performance
   Legacy UNIX compatibility
   Messaging Client Support
   Messaging Server Support
   Milkymist
   NFS file server
   Network file system client
   Networking Tools
   Performance Tools
   Perl Support
   Scientific support
   Server Platform
Installed Language Groups:
   Arabic Support [ar]
   Armenian Support [hy]
   Georgian Support [ka]
   Hebrew Support [he]
   Inuktitut Support [iu]
   Japanese Support [ja]
   Korean Support [ko]
   Lao Support [lo]
   Tajik Support [tg]
Available Groups:
   Backup Client
   Backup Server
   CIFS file server
   Compatibility libraries
   Desktop
   Desktop Debugging and Performance Tools
   Desktop Platform Development
   Development tools
   Dial-up Networking Support
   Directory Server
   Eclipse
   Educational Software
   Electronic Lab
   Emacs
   FCoE Storage Client
   FTP server
   Fedora Packager
   General Purpose Desktop
   Graphics Creation Tools
   Haskell
   Identity Management Server
   Infiniband Support
   Input Methods
   Internet Applications
   Internet Browser
   KDE Desktop
   Legacy X Window System compatibility
   Mainframe Access
   MySQL Database client
   MySQL Database server
   Network Infrastructure Server
   Network Storage Server
   Office Suite and Productivity
   PHP Support
   PostgreSQL Database client
   PostgreSQL Database server
   Print Server
   Printing client
   Remote Desktop Clients
   Ruby Support
   SNMP Support
   Security Tools
   Server Platform Development
   Smart card support
   Somali Support
   Storage Availability Tools
   System Management
   System administration tools
   TeX support
   Technical Writing
   TurboGears application framework
   Virtualization
   Virtualization Client
   Virtualization Platform
   Virtualization Tools
   Web Server
   Web Servlet Engine
   Web-Based Enterprise Management
   X Window System
   Xfce
   iSCSI Storage Client
Available Language Groups:
   Afrikaans Support [af]
   Albanian Support [sq]
   Amazigh Support [ber]
   Assamese Support [as]
   Azerbaijani Support [az]
   Basque Support [eu]
   Belarusian Support [be]
   Bengali Support [bn]
   Bhutanese Support [dz]
   Brazilian Portuguese Support [pt_BR]
   Breton Support [br]
   Bulgarian Support [bg]
   Catalan Support [ca]
   Chhattisgarhi Support [hne]
   Chichewa Support [ny]
   Chinese Support [zh]
   Coptic Support [cop]
   Croatian Support [hr]
   Czech Support [cs]
   Danish Support [da]
   Dutch Support [nl]
   English (UK) Support [en_GB]
   Esperanto Support [eo]
   Estonian Support [et]
   Ethiopic Support [am]
   Faroese Support [fo]
   Fijian Support [fj]
   Filipino Support [fil]
   Finnish Support [fi]
   French Support [fr]
   Frisian Support [fy]
   Friulian Support [fur]
   Gaelic Support [gd]
   Galician Support [gl]
   German Support [de]
   Greek Support [el]
   Gujarati Support [gu]
   Hiligaynon Support [hil]
   Hindi Support [hi]
   Hungarian Support [hu]
   Icelandic Support [is]
   Indonesian Support [id]
   Interlingua Support [ia]
   Irish Support [ga]
   Italian Support [it]
   Kannada Support [kn]
   Kashmiri Support [ks]
   Kashubian Support [csb]
   Kazakh Support [kk]
   Khmer Support [km]
   Kinyarwanda Support [rw]
   Konkani Support [kok]
   Kurdish Support [ku]
   Latin Support [la]
   Latvian Support [lv]
   Lithuanian Support [lt]
   Low Saxon Support [nds]
   Luxembourgish Support [lb]
   Macedonian Support [mk]
   Maithili Support [mai]
   Malagasy Support [mg]
   Malay Support [ms]
   Malayalam Support [ml]
   Maltese Support [mt]
   Manx Support [gv]
   Maori Support [mi]
   Marathi Support [mr]
   Mongolian Support [mn]
   Myanmar (Burmese) Support [my]
   Nepali Support [ne]
   Northern Sotho Support [nso]
   Norwegian Support [nb]
   Occitan Support [oc]
   Oriya Support [or]
   Persian Support [fa]
   Polish Support [pl]
   Portuguese Support [pt]
   Punjabi Support [pa]
   Romanian Support [ro]
   Russian Support [ru]
   Sanskrit Support [sa]
   Sardinian Support [sc]
   Serbian Support [sr]
   Sindhi Support [sd]
   Sinhala Support [si]
   Slovak Support [sk]
   Slovenian Support [sl]
   Southern Ndebele Support [nr]
   Southern Sotho Support [st]
   Spanish Support [es]
   Swahili Support [sw]
   Swati Support [ss]
   Swedish Support [sv]
   Tagalog Support [tl]
   Tamil Support [ta]
   Telugu Support [te]
   Tetum Support [tet]
   Thai Support [th]
   Tibetan Support [bo]
   Tsonga Support [ts]
   Tswana Support [tn]
   Turkish Support [tr]
   Turkmen Support [tk]
   Ukrainian Support [uk]
   Upper Sorbian Support [hsb]
   Urdu Support [ur]
   Uzbek Support [uz]
   Venda Support [ve]
   Vietnamese Support [vi]
   Walloon Support [wa]
   Welsh Support [cy]
   Xhosa Support [xh]
   Zulu Support [zu]
Done 
EXPECTED RESULT: 
RETURN CODE: 0
PASS
######################################################################################
# NEW TEST: ## Install Development tools group...
######################################################################################
COMMAND:  /usr/bin/yum -y groupinstall 'Development tools'
Unable to read consumer identity
Error: Package: glibc-devel-2.12-1.47.el6_2.12.i686 (rhui-ap-southeast-1-rhel-server-releases)
           Requires: glibc = 2.12-1.47.el6_2.12
           Installed: glibc-2.12-1.80.el6.i686 (@koji-override-0/$releasever)
               glibc = 2.12-1.80.el6
           Available: glibc-2.12-1.7.el6.i686 (rhui-ap-southeast-1-rhel-server-releases)
               glibc = 2.12-1.7.el6
           Available: glibc-2.12-1.7.el6_0.3.i686 (rhui-ap-southeast-1-rhel-server-releases)
               glibc = 2.12-1.7.el6_0.3
           Available: glibc-2.12-1.7.el6_0.4.i686 (rhui-ap-southeast-1-rhel-server-releases)
               glibc = 2.12-1.7.el6_0.4
           Available: glibc-2.12-1.7.el6_0.5.i686 (rhui-ap-southeast-1-rhel-server-releases)
               glibc = 2.12-1.7.el6_0.5
           Available: glibc-2.12-1.25.el6.i686 (rhui-ap-southeast-1-rhel-server-releases)
               glibc = 2.12-1.25.el6
           Available: glibc-2.12-1.25.el6_1.3.i686 (rhui-ap-southeast-1-rhel-server-releases)
               glibc = 2.12-1.25.el6_1.3
           Available: glibc-2.12-1.47.el6.i686 (rhui-ap-southeast-1-rhel-server-releases)
               glibc = 2.12-1.47.el6
           Available: glibc-2.12-1.47.el6_2.5.i686 (rhui-ap-southeast-1-rhel-server-releases)
               glibc = 2.12-1.47.el6_2.5
           Available: glibc-2.12-1.47.el6_2.9.i686 (rhui-ap-southeast-1-rhel-server-releases)
               glibc = 2.12-1.47.el6_2.9
           Available: glibc-2.12-1.47.el6_2.12.i686 (rhui-ap-southeast-1-rhel-server-releases)
               glibc = 2.12-1.47.el6_2.12
Error: Package: glibc-headers-2.12-1.47.el6_2.12.i686 (rhui-ap-southeast-1-rhel-server-releases)
           Requires: glibc = 2.12-1.47.el6_2.12
           Installed: glibc-2.12-1.80.el6.i686 (@koji-override-0/$releasever)
               glibc = 2.12-1.80.el6
           Available: glibc-2.12-1.7.el6.i686 (rhui-ap-southeast-1-rhel-server-releases)
               glibc = 2.12-1.7.el6
           Available: glibc-2.12-1.7.el6_0.3.i686 (rhui-ap-southeast-1-rhel-server-releases)
               glibc = 2.12-1.7.el6_0.3
           Available: glibc-2.12-1.7.el6_0.4.i686 (rhui-ap-southeast-1-rhel-server-releases)
               glibc = 2.12-1.7.el6_0.4
           Available: glibc-2.12-1.7.el6_0.5.i686 (rhui-ap-southeast-1-rhel-server-releases)
               glibc = 2.12-1.7.el6_0.5
           Available: glibc-2.12-1.25.el6.i686 (rhui-ap-southeast-1-rhel-server-releases)
               glibc = 2.12-1.25.el6
           Available: glibc-2.12-1.25.el6_1.3.i686 (rhui-ap-southeast-1-rhel-server-releases)
               glibc = 2.12-1.25.el6_1.3
           Available: glibc-2.12-1.47.el6.i686 (rhui-ap-southeast-1-rhel-server-releases)
               glibc = 2.12-1.47.el6
           Available: glibc-2.12-1.47.el6_2.5.i686 (rhui-ap-southeast-1-rhel-server-releases)
               glibc = 2.12-1.47.el6_2.5
           Available: glibc-2.12-1.47.el6_2.9.i686 (rhui-ap-southeast-1-rhel-server-releases)
               glibc = 2.12-1.47.el6_2.9
           Available: glibc-2.12-1.47.el6_2.12.i686 (rhui-ap-southeast-1-rhel-server-releases)
               glibc = 2.12-1.47.el6_2.12
Error: Package: rpm-build-4.8.0-19.el6_2.1.i686 (rhui-ap-southeast-1-rhel-server-releases)
           Requires: rpm = 4.8.0-19.el6_2.1
           Installed: rpm-4.8.0-27.el6.i686 (@koji-override-0/$releasever)
               rpm = 4.8.0-27.el6
           Available: rpm-4.8.0-12.el6.i686 (rhui-ap-southeast-1-rhel-server-releases)
               rpm = 4.8.0-12.el6
           Available: rpm-4.8.0-16.el6.i686 (rhui-ap-southeast-1-rhel-server-releases)
               rpm = 4.8.0-16.el6
           Available: rpm-4.8.0-16.el6_1.1.i686 (rhui-ap-southeast-1-rhel-server-releases)
               rpm = 4.8.0-16.el6_1.1
           Available: rpm-4.8.0-19.el6.i686 (rhui-ap-southeast-1-rhel-server-releases)
               rpm = 4.8.0-19.el6
           Available: rpm-4.8.0-19.el6_2.1.i686 (rhui-ap-southeast-1-rhel-server-releases)
               rpm = 4.8.0-19.el6_2.1
Error: Package: gcc-gfortran-4.4.6-3.el6.i686 (rhui-ap-southeast-1-rhel-server-releases)
           Requires: libgfortran = 4.4.6-3.el6
           Installed: libgfortran-4.4.6-4.el6.i686 (@koji-override-0/$releasever)
               libgfortran = 4.4.4-15.el6
               libgfortran = 4.4.6-4.el6
           Available: libgfortran-4.4.4-13.el6.i686 (rhui-ap-southeast-1-rhel-server-releases)
               libgfortran = 4.4.4-13.el6
           Available: libgfortran-4.4.5-6.el6.i686 (rhui-ap-southeast-1-rhel-server-releases)
               libgfortran = 4.4.5-6.el6
               libgfortran = 4.4.4-15.el6
           Available: libgfortran-4.4.6-3.el6.i686 (rhui-ap-southeast-1-rhel-server-releases)
               libgfortran = 4.4.6-3.el6
               libgfortran = 4.4.4-15.el6
Error: Package: gcc-c++-4.4.6-3.el6.i686 (rhui-ap-southeast-1-rhel-server-releases)
           Requires: libstdc++ = 4.4.6-3.el6
           Installed: libstdc++-4.4.6-4.el6.i686 (@koji-override-0/$releasever)
               libstdc++ = 4.4.4-15.el6
               libstdc++ = 4.4.6-4.el6
           Available: libstdc++-4.4.4-13.el6.i686 (rhui-ap-southeast-1-rhel-server-releases)
               libstdc++ = 4.4.4-13.el6
           Available: libstdc++-4.4.5-6.el6.i686 (rhui-ap-southeast-1-rhel-server-releases)
               libstdc++ = 4.4.5-6.el6
               libstdc++ = 4.4.4-15.el6
           Available: libstdc++-4.4.6-3.el6.i686 (rhui-ap-southeast-1-rhel-server-releases)
               libstdc++ = 4.4.6-3.el6
               libstdc++ = 4.4.4-15.el6
Error: Package: libstdc++-devel-4.4.6-3.el6.i686 (rhui-ap-southeast-1-rhel-server-releases)
           Requires: libstdc++(x86-32) = 4.4.6-3.el6
           Installed: libstdc++-4.4.6-4.el6.i686 (@koji-override-0/$releasever)
               libstdc++(x86-32) = 4.4.6-4.el6
           Available: libstdc++-4.4.4-13.el6.i686 (rhui-ap-southeast-1-rhel-server-releases)
               libstdc++(x86-32) = 4.4.4-13.el6
           Available: libstdc++-4.4.5-6.el6.i686 (rhui-ap-southeast-1-rhel-server-releases)
               libstdc++(x86-32) = 4.4.5-6.el6
           Available: libstdc++-4.4.6-3.el6.i686 (rhui-ap-southeast-1-rhel-server-releases)
               libstdc++(x86-32) = 4.4.6-3.el6
Error: Package: systemtap-1.6-5.el6_2.i686 (rhui-ap-southeast-1-rhel-server-releases)
           Requires: systemtap-runtime = 1.6-5.el6_2
           Installed: systemtap-runtime-1.7-5.el6.i686 (@koji-override-0/$releasever)
               systemtap-runtime = 1.7-5.el6
           Available: systemtap-runtime-1.2-9.el6.i686 (rhui-ap-southeast-1-rhel-server-releases)
               systemtap-runtime = 1.2-9.el6
           Available: systemtap-runtime-1.2-11.el6_0.i686 (rhui-ap-southeast-1-rhel-server-releases)
               systemtap-runtime = 1.2-11.el6_0
           Available: systemtap-runtime-1.4-6.el6.i686 (rhui-ap-southeast-1-rhel-server-releases)
               systemtap-runtime = 1.4-6.el6
           Available: systemtap-runtime-1.4-6.el6_1.1.i686 (rhui-ap-southeast-1-rhel-server-releases)
               systemtap-runtime = 1.4-6.el6_1.1
           Available: systemtap-runtime-1.4-6.el6_1.2.i686 (rhui-ap-southeast-1-rhel-server-releases)
               systemtap-runtime = 1.4-6.el6_1.2
Comment 6 mkovacik 2012-06-18 04:13:21 EDT
           Available: systemtap-runtime-1.4-6.el6_1.3.i686 (rhui-ap-southeast-1-rhel-server-releases)
               systemtap-runtime = 1.4-6.el6_1.3
           Available: systemtap-runtime-1.6-4.el6.i686 (rhui-ap-southeast-1-rhel-server-releases)
               systemtap-runtime = 1.6-4.el6
           Available: systemtap-runtime-1.6-5.el6_2.i686 (rhui-ap-southeast-1-rhel-server-releases)
               systemtap-runtime = 1.6-5.el6_2
Error: Package: gcc-4.4.6-3.el6.i686 (rhui-ap-southeast-1-rhel-server-releases)
           Requires: libgomp = 4.4.6-3.el6
           Installed: libgomp-4.4.6-4.el6.i686 (@koji-override-0/$releasever)
               libgomp = 4.4.4-15.el6
               libgomp = 4.4.6-4.el6
           Available: libgomp-4.4.4-13.el6.i686 (rhui-ap-southeast-1-rhel-server-releases)
               libgomp = 4.4.4-13.el6
           Available: libgomp-4.4.5-6.el6.i686 (rhui-ap-southeast-1-rhel-server-releases)
               libgomp = 4.4.5-6.el6
               libgomp = 4.4.4-15.el6
           Available: libgomp-4.4.6-3.el6.i686 (rhui-ap-southeast-1-rhel-server-releases)
               libgomp = 4.4.6-3.el6
               libgomp = 4.4.4-15.el6
RESULT: Loaded plugins: amazon-id, product-id, rhui-lb, security, subscription-manager
Updating certificate-based repositories.
Setting up Group Process
Package matching 1:make-3.81-19.el6.i686 already installed. Checking for update.
Package 1:pkgconfig-0.23-9.1.el6.i686 already installed and latest version
Package gettext-0.17-16.el6.i686 already installed and latest version
Package patch-2.6-6.el6.i686 already installed and latest version
Package matching binutils-2.20.51.0.2-5.28.el6.i686 already installed. Checking for update.
Package elfutils-0.152-1.el6.i686 already installed and latest version
Package cvs-1.11.23-11.el6_2.1.i686 already installed and latest version
Resolving Dependencies
--> Running transaction check
---> Package autoconf.noarch 0:2.63-5.1.el6 will be installed
---> Package automake.noarch 0:1.11.1-1.2.el6 will be installed
---> Package bison.i686 0:2.4.1-5.el6 will be installed
---> Package byacc.i686 0:1.9.20070509-6.1.el6 will be installed
---> Package cscope.i686 0:15.6-6.el6 will be installed
---> Package ctags.i686 0:5.8-2.el6 will be installed
---> Package diffstat.i686 0:1.51-2.el6 will be installed
---> Package doxygen.i686 1:1.6.1-6.el6 will be installed
---> Package flex.i686 0:2.5.35-8.el6 will be installed
---> Package gcc.i686 0:4.4.6-3.el6 will be installed
--> Processing Dependency: libgomp = 4.4.6-3.el6 for package: gcc-4.4.6-3.el6.i686
--> Processing Dependency: cpp = 4.4.6-3.el6 for package: gcc-4.4.6-3.el6.i686
--> Processing Dependency: glibc-devel >= 2.2.90-12 for package: gcc-4.4.6-3.el6.i686
--> Processing Dependency: cloog-ppl >= 0.15 for package: gcc-4.4.6-3.el6.i686
---> Package gcc-c++.i686 0:4.4.6-3.el6 will be installed
--> Processing Dependency: libstdc++-devel = 4.4.6-3.el6 for package: gcc-c++-4.4.6-3.el6.i686
--> Processing Dependency: libstdc++ = 4.4.6-3.el6 for package: gcc-c++-4.4.6-3.el6.i686
--> Processing Dependency: libmpfr.so.1 for package: gcc-c++-4.4.6-3.el6.i686
---> Package gcc-gfortran.i686 0:4.4.6-3.el6 will be installed
--> Processing Dependency: libgfortran = 4.4.6-3.el6 for package: gcc-gfortran-4.4.6-3.el6.i686
---> Package git.i686 0:1.7.1-2.el6_0.1 will be installed
--> Processing Dependency: perl-Git = 1.7.1-2.el6_0.1 for package: git-1.7.1-2.el6_0.1.i686
--> Processing Dependency: perl(Git) for package: git-1.7.1-2.el6_0.1.i686
--> Processing Dependency: perl(Error) for package: git-1.7.1-2.el6_0.1.i686
---> Package indent.i686 0:2.2.10-5.1.el6 will be installed
---> Package intltool.noarch 0:0.41.0-1.1.el6 will be installed
--> Processing Dependency: gettext-devel for package: intltool-0.41.0-1.1.el6.noarch
---> Package libtool.i686 0:2.2.6-15.5.el6 will be installed
---> Package patchutils.i686 0:0.3.1-3.1.el6 will be installed
---> Package rcs.i686 0:5.7-37.el6 will be installed
---> Package redhat-rpm-config.noarch 0:9.0.3-34.el6 will be installed
---> Package rpm-build.i686 0:4.8.0-19.el6_2.1 will be installed
--> Processing Dependency: rpm = 4.8.0-19.el6_2.1 for package: rpm-build-4.8.0-19.el6_2.1.i686
---> Package subversion.i686 0:1.6.11-2.el6_1.4 will be installed
--> Processing Dependency: apr >= 1.3.0 for package: subversion-1.6.11-2.el6_1.4.i686
--> Processing Dependency: libneon.so.27 for package: subversion-1.6.11-2.el6_1.4.i686
--> Processing Dependency: libaprutil-1.so.0 for package: subversion-1.6.11-2.el6_1.4.i686
--> Processing Dependency: libapr-1.so.0 for package: subversion-1.6.11-2.el6_1.4.i686
---> Package swig.i686 0:1.3.40-6.el6 will be installed
---> Package systemtap.i686 0:1.6-5.el6_2 will be installed
--> Processing Dependency: systemtap-runtime = 1.6-5.el6_2 for package: systemtap-1.6-5.el6_2.i686
--> Processing Dependency: kernel-devel for package: systemtap-1.6-5.el6_2.i686
--> Running transaction check
---> Package apr.i686 0:1.3.9-5.el6_2 will be installed
---> Package apr-util.i686 0:1.3.9-3.el6_0.1 will be installed
---> Package cloog-ppl.i686 0:0.15.7-1.2.el6 will be installed
--> Processing Dependency: libppl_c.so.2 for package: cloog-ppl-0.15.7-1.2.el6.i686
--> Processing Dependency: libppl.so.7 for package: cloog-ppl-0.15.7-1.2.el6.i686
---> Package cpp.i686 0:4.4.6-3.el6 will be installed
---> Package gcc.i686 0:4.4.6-3.el6 will be installed
--> Processing Dependency: libgomp = 4.4.6-3.el6 for package: gcc-4.4.6-3.el6.i686
---> Package gcc-c++.i686 0:4.4.6-3.el6 will be installed
--> Processing Dependency: libstdc++ = 4.4.6-3.el6 for package: gcc-c++-4.4.6-3.el6.i686
---> Package gcc-gfortran.i686 0:4.4.6-3.el6 will be installed
--> Processing Dependency: libgfortran = 4.4.6-3.el6 for package: gcc-gfortran-4.4.6-3.el6.i686
---> Package gettext-devel.i686 0:0.17-16.el6 will be installed
--> Processing Dependency: gettext-libs = 0.17-16.el6 for package: gettext-devel-0.17-16.el6.i686
--> Processing Dependency: libgettextpo.so.0 for package: gettext-devel-0.17-16.el6.i686
--> Processing Dependency: libgcj_bc.so.1 for package: gettext-devel-0.17-16.el6.i686
--> Processing Dependency: libasprintf.so.0 for package: gettext-devel-0.17-16.el6.i686
---> Package glibc-devel.i686 0:2.12-1.47.el6_2.12 will be installed
--> Processing Dependency: glibc-headers = 2.12-1.47.el6_2.12 for package: glibc-devel-2.12-1.47.el6_2.12.i686
--> Processing Dependency: glibc = 2.12-1.47.el6_2.12 for package: glibc-devel-2.12-1.47.el6_2.12.i686
--> Processing Dependency: glibc-headers for package: glibc-devel-2.12-1.47.el6_2.12.i686
---> Package kernel-devel.i686 0:2.6.32-220.17.1.el6 will be installed
---> Package libstdc++-devel.i686 0:4.4.6-3.el6 will be installed
--> Processing Dependency: libstdc++(x86-32) = 4.4.6-3.el6 for package: libstdc++-devel-4.4.6-3.el6.i686
---> Package mpfr.i686 0:2.4.1-6.el6 will be installed
---> Package neon.i686 0:0.29.3-1.2.el6 will be installed
--> Processing Dependency: libproxy.so.0 for package: neon-0.29.3-1.2.el6.i686
--> Processing Dependency: libpakchois.so.0 for package: neon-0.29.3-1.2.el6.i686
---> Package perl-Error.noarch 1:0.17015-4.el6 will be installed
---> Package perl-Git.noarch 0:1.7.1-2.el6_0.1 will be installed
---> Package rpm-build.i686 0:4.8.0-19.el6_2.1 will be installed
--> Processing Dependency: rpm = 4.8.0-19.el6_2.1 for package: rpm-build-4.8.0-19.el6_2.1.i686
---> Package systemtap.i686 0:1.6-5.el6_2 will be installed
--> Processing Dependency: systemtap-runtime = 1.6-5.el6_2 for package: systemtap-1.6-5.el6_2.i686
--> Running transaction check
---> Package gcc.i686 0:4.4.6-3.el6 will be installed
--> Processing Dependency: libgomp = 4.4.6-3.el6 for package: gcc-4.4.6-3.el6.i686
---> Package gcc-c++.i686 0:4.4.6-3.el6 will be installed
--> Processing Dependency: libstdc++ = 4.4.6-3.el6 for package: gcc-c++-4.4.6-3.el6.i686
---> Package gcc-gfortran.i686 0:4.4.6-3.el6 will be installed
--> Processing Dependency: libgfortran = 4.4.6-3.el6 for package: gcc-gfortran-4.4.6-3.el6.i686
---> Package gettext-libs.i686 0:0.17-16.el6 will be installed
---> Package glibc-devel.i686 0:2.12-1.47.el6_2.12 will be installed
--> Processing Dependency: glibc = 2.12-1.47.el6_2.12 for package: glibc-devel-2.12-1.47.el6_2.12.i686
---> Package glibc-headers.i686 0:2.12-1.47.el6_2.12 will be installed
--> Processing Dependency: glibc = 2.12-1.47.el6_2.12 for package: glibc-headers-2.12-1.47.el6_2.12.i686
--> Processing Dependency: kernel-headers >= 2.2.1 for package: glibc-headers-2.12-1.47.el6_2.12.i686
--> Processing Dependency: kernel-headers for package: glibc-headers-2.12-1.47.el6_2.12.i686
---> Package libgcj.i686 0:4.4.6-3.el6 will be installed
--> Processing Dependency: libart_lgpl >= 2.1.0 for package: libgcj-4.4.6-3.el6.i686
---> Package libproxy.i686 0:0.3.0-2.el6 will be installed
--> Processing Dependency: libproxy-python = 0.3.0-2.el6 for package: libproxy-0.3.0-2.el6.i686
--> Processing Dependency: libproxy-bin = 0.3.0-2.el6 for package: libproxy-0.3.0-2.el6.i686
---> Package libstdc++-devel.i686 0:4.4.6-3.el6 will be installed
--> Processing Dependency: libstdc++(x86-32) = 4.4.6-3.el6 for package: libstdc++-devel-4.4.6-3.el6.i686
---> Package pakchois.i686 0:0.4-3.2.el6 will be installed
---> Package ppl.i686 0:0.10.2-11.el6 will be installed
---> Package rpm-build.i686 0:4.8.0-19.el6_2.1 will be installed
--> Processing Dependency: rpm = 4.8.0-19.el6_2.1 for package: rpm-build-4.8.0-19.el6_2.1.i686
---> Package systemtap.i686 0:1.6-5.el6_2 will be installed
--> Processing Dependency: systemtap-runtime = 1.6-5.el6_2 for package: systemtap-1.6-5.el6_2.i686
--> Running transaction check
---> Package gcc.i686 0:4.4.6-3.el6 will be installed
--> Processing Dependency: libgomp = 4.4.6-3.el6 for package: gcc-4.4.6-3.el6.i686
---> Package gcc-c++.i686 0:4.4.6-3.el6 will be installed
--> Processing Dependency: libstdc++ = 4.4.6-3.el6 for package: gcc-c++-4.4.6-3.el6.i686
---> Package gcc-gfortran.i686 0:4.4.6-3.el6 will be installed
--> Processing Dependency: libgfortran = 4.4.6-3.el6 for package: gcc-gfortran-4.4.6-3.el6.i686
---> Package glibc-devel.i686 0:2.12-1.47.el6_2.12 will be installed
--> Processing Dependency: glibc = 2.12-1.47.el6_2.12 for package: glibc-devel-2.12-1.47.el6_2.12.i686
---> Package glibc-headers.i686 0:2.12-1.47.el6_2.12 will be installed
--> Processing Dependency: glibc = 2.12-1.47.el6_2.12 for package: glibc-headers-2.12-1.47.el6_2.12.i686
---> Package kernel-headers.i686 0:2.6.32-220.17.1.el6 will be installed
---> Package libart_lgpl.i686 0:2.3.20-5.1.el6 will be installed
---> Package libproxy-bin.i686 0:0.3.0-2.el6 will be installed
---> Package libproxy-python.i686 0:0.3.0-2.el6 will be installed
---> Package libstdc++-devel.i686 0:4.4.6-3.el6 will be installed
--> Processing Dependency: libstdc++(x86-32) = 4.4.6-3.el6 for package: libstdc++-devel-4.4.6-3.el6.i686
---> Package rpm-build.i686 0:4.8.0-19.el6_2.1 will be installed
--> Processing Dependency: rpm = 4.8.0-19.el6_2.1 for package: rpm-build-4.8.0-19.el6_2.1.i686
---> Package systemtap.i686 0:1.6-5.el6_2 will be installed
--> Processing Dependency: systemtap-runtime = 1.6-5.el6_2 for package: systemtap-1.6-5.el6_2.i686
--> Finished Dependency Resolution
 You could try using --skip-broken to work around the problem
 You could try running: rpm -Va --nofiles --nodigest 
EXPECTED RESULT: 
RETURN CODE: 1
FAIL1
Loaded plugins: amazon-id, product-id, rhui-lb, security, subscription-manager Updating certificate-based repositories. Setting up Group Process Package matching 1:make-3.81-19.el6.i686 already installed. Checking for update. Package 1:pkgconfig-0.23-9.1.el6.i686 already installed and latest version Package gettext-0.17-16.el6.i686 already installed and latest version Package patch-2.6-6.el6.i686 already installed and latest version Package matching binutils-2.20.51.0.2-5.28.el6.i686 already installed. Checking for update. Package elfutils-0.152-1.el6.i686 already installed and latest version Package cvs-1.11.23-11.el6_2.1.i686 already installed and latest version Resolving Dependencies --> Running transaction check ---> Package autoconf.noarch 0:2.63-5.1.el6 will be installed ---> Package automake.noarch 0:1.11.1-1.2.el6 will be installed ---> Package bison.i686 0:2.4.1-5.el6 will be installed ---> Package byacc.i686 0:1.9.20070509-6.1.el6 will be installed ---> Package cscope.i686 0:15.6-6.el6 will be installed ---> Package ctags.i686 0:5.8-2.el6 will be installed ---> Package diffstat.i686 0:1.51-2.el6 will be installed ---> Package doxygen.i686 1:1.6.1-6.el6 will be installed ---> Package flex.i686 0:2.5.35-8.el6 will be installed ---> Package gcc.i686 0:4.4.6-3.el6 will be installed --> Processing Dependency: libgomp = 4.4.6-3.el6 for package: gcc-4.4.6-3.el6.i686 --> Processing Dependency: cpp = 4.4.6-3.el6 for package: gcc-4.4.6-3.el6.i686 --> Processing Dependency: glibc-devel >= 2.2.90-12 for package: gcc-4.4.6-3.el6.i686 --> Processing Dependency: cloog-ppl >= 0.15 for package: gcc-4.4.6-3.el6.i686 ---> Package gcc-c++.i686 0:4.4.6-3.el6 will be installed --> Processing Dependency: libstdc++-devel = 4.4.6-3.el6 for package: gcc-c++-4.4.6-3.el6.i686 --> Processing Dependency: libstdc++ = 4.4.6-3.el6 for package: gcc-c++-4.4.6-3.el6.i686 --> Processing Dependency: libmpfr.so.1 for package: gcc-c++-4.4.6-3.el6.i686 ---> Package gcc-gfortran.i686 0:4.4.6-3.el6 will be installed --> Processing Dependency: libgfortran = 4.4.6-3.el6 for package: gcc-gfortran-4.4.6-3.el6.i686 ---> Package git.i686 0:1.7.1-2.el6_0.1 will be installed --> Processing Dependency: perl-Git = 1.7.1-2.el6_0.1 for package: git-1.7.1-2.el6_0.1.i686 --> Processing Dependency: perl(Git) for package: git-1.7.1-2.el6_0.1.i686 --> Processing Dependency: perl(Error) for package: git-1.7.1-2.el6_0.1.i686 ---> Package indent.i686 0:2.2.10-5.1.el6 will be installed ---> Package intltool.noarch 0:0.41.0-1.1.el6 will be installed --> Processing Dependency: gettext-devel for package: intltool-0.41.0-1.1.el6.noarch ---> Package libtool.i686 0:2.2.6-15.5.el6 will be installed ---> Package patchutils.i686 0:0.3.1-3.1.el6 will be installed ---> Package rcs.i686 0:5.7-37.el6 will be installed ---> Package redhat-rpm-config.noarch 0:9.0.3-34.el6 will be installed ---> Package rpm-build.i686 0:4.8.0-19.el6_2.1 will be installed --> Processing Dependency: rpm = 4.8.0-19.el6_2.1 for package: rpm-build-4.8.0-19.el6_2.1.i686 ---> Package subversion.i686 0:1.6.11-2.el6_1.4 will be installed --> Processing Dependency: apr >= 1.3.0 for package: subversion-1.6.11-2.el6_1.4.i686 --> Processing Dependency: libneon.so.27 for package: subversion-1.6.11-2.el6_1.4.i686 --> Processing Dependency: libaprutil-1.so.0 for package: subversion-1.6.11-2.el6_1.4.i686 --> Processing Dependency: libapr-1.so.0 for package: subversion-1.6.11-2.el6_1.4.i686 ---> Package swig.i686 0:1.3.40-6.el6 will be installed ---> Package systemtap.i686 0:1.6-5.el6_2 will be installed --> Processing Dependency: systemtap-runtime = 1.6-5.el6_2 for package: systemtap-1.6-5.el6_2.i686 --> Processing Dependency: kernel-devel for package: systemtap-1.6-5.el6_2.i686 --> Running transaction check ---> Package apr.i686 0:1.3.9-5.el6_2 will be installed ---> Package apr-util.i686 0:1.3.9-3.el6_0.1 will be installed ---> Package cloog-ppl.i686 0:0.15.7-1.2.el6 will be installed --> Processing Dependency: libppl_c.so.2 for package: cloog-ppl-0.15.7-1.2.el6.i686 --> Processing Dependency: libppl.so.7 for package: cloog-ppl-0.15.7-1.2.el6.i686 ---> Package cpp.i686 0:4.4.6-3.el6 will be installed ---> Package gcc.i686 0:4.4.6-3.el6 will be installed --> Processing Dependency: libgomp = 4.4.6-3.el6 for package: gcc-4.4.6-3.el6.i686 ---> Package gcc-c++.i686 0:4.4.6-3.el6 will be installed --> Processing Dependency: libstdc++ = 4.4.6-3.el6 for package: gcc-c++-4.4.6-3.el6.i686 ---> Package gcc-gfortran.i686 0:4.4.6-3.el6 will be installed --> Processing Dependency: libgfortran = 4.4.6-3.el6 for package: gcc-gfortran-4.4.6-3.el6.i686 ---> Package gettext-devel.i686 0:0.17-16.el6 will be installed --> Processing Dependency: gettext-libs = 0.17-16.el6 for package: gettext-devel-0.17-16.el6.i686 --> Processing Dependency: libgettextpo.so.0 for package: gettext-devel-0.17-16.el6.i686 --> Processing Dependency: libgcj_bc.so.1 for package: gettext-devel-0.17-16.el6.i686 --> Processing Dependency: libasprintf.so.0 for package: gettext-devel-0.17-16.el6.i686 ---> Package glibc-devel.i686 0:2.12-1.47.el6_2.12 will be installed --> Processing Dependency: glibc-headers = 2.12-1.47.el6_2.12 for package: glibc-devel-2.12-1.47.el6_2.12.i686 --> Processing Dependency: glibc = 2.12-1.47.el6_2.12 for package: glibc-devel-2.12-1.47.el6_2.12.i686 --> Processing Dependency: glibc-headers for package: glibc-devel-2.12-1.47.el6_2.12.i686 ---> Package kernel-devel.i686 0:2.6.32-220.17.1.el6 will be installed ---> Package libstdc++-devel.i686 0:4.4.6-3.el6 will be installed --> Processing Dependency: libstdc++(x86-32) = 4.4.6-3.el6 for package: libstdc++-devel-4.4.6-3.el6.i686 ---> Package mpfr.i686 0:2.4.1-6.el6 will be installed ---> Package neon.i686 0:0.29.3-1.2.el6 will be installed --> Processing Dependency: libproxy.so.0 for package: neon-0.29.3-1.2.el6.i686 --> Processing Dependency: libpakchois.so.0 for package: neon-0.29.3-1.2.el6.i686 ---> Package perl-Error.noarch 1:0.17015-4.el6 will be installed ---> Package perl-Git.noarch 0:1.7.1-2.el6_0.1 will be installed ---> Package rpm-build.i686 0:4.8.0-19.el6_2.1 will be installed --> Processing Dependency: rpm = 4.8.0-19.el6_2.1 for package: rpm-build-4.8.0-19.el6_2.1.i686 ---> Package systemtap.i686 0:1.6-5.el6_2 will be installed --> Processing Dependency: systemtap-runtime = 1.6-5.el6_2 for package: systemtap-1.6-5.el6_2.i686 --> Running transaction check ---> Package gcc.i686 0:4.4.6-3.el6 will be installed --> Processing Dependency: libgomp = 4.4.6-3.el6 for package: gcc-4.4.6-3.el6.i686 ---> Package gcc-c++.i686 0:4.4.6-3.el6 will be installed --> Processing Dependency: libstdc++ = 4.4.6-3.el6 for package: gcc-c++-4.4.6-3.el6.i686 ---> Package gcc-gfortran.i686 0:4.4.6-3.el6 will be installed --> Processing Dependency: libgfortran = 4.4.6-3.el6 for package: gcc-gfortran-4.4.6-3.el6.i686 ---> Package gettext-libs.i686 0:0.17-16.el6 will be installed ---> Package glibc-devel.i686 0:2.12-1.47.el6_2.12 will be installed --> Processing Dependency: glibc = 2.12-1.47.el6_2.12 for package: glibc-devel-2.12-1.47.el6_2.12.i686 ---> Package glibc-headers.i686 0:2.12-1.47.el6_2.12 will be installed --> Processing Dependency: glibc = 2.12-1.47.el6_2.12 for package: glibc-headers-2.12-1.47.el6_2.12.i686 --> Processing Dependency: kernel-headers >= 2.2.1 for package: glibc-headers-2.12-1.47.el6_2.12.i686 --> Processing Dependency: kernel-headers for package: glibc-headers-2.12-1.47.el6_2.12.i686 ---> Package libgcj.i686 0:4.4.6-3.el6 will be installed --> Processing Dependency: libart_lgpl >= 2.1.0 for package: libgcj-4.4.6-3.el6.i686 ---> Package libproxy.i686 0:0.3.0-2.el6 will be installed --> Processing Dependency: libproxy-python = 0.3.0-2.el6 for package: libproxy-0.3.0-2.el6.i686 --> Processing Dependency: libproxy-bin = 0.3.0-2.el6 for package: libproxy-0.3.0-2.el6.i686 ---> Package libstdc++-devel.i686 0:4.4.6-3.el6 will be installed --> Processing Dependency: libstdc++(x86-32) = 4.4.6-3.el6 for package: libstdc++-devel-4.4.6-3.el6.i686 ---> Package pakchois.i686 0:0.4-3.2.el6 will be installed ---> Package ppl.i686 0:0.10.2-11.el6 will be installed ---> Package rpm-build.i686 0:4.8.0-19.el6_2.1 will be installed --> Processing Dependency: rpm = 4.8.0-19.el6_2.1 for package: rpm-build-4.8.0-19.el6_2.1.i686 ---> Package systemtap.i686 0:1.6-5.el6_2 will be installed --> Processing Dependency: systemtap-runtime = 1.6-5.el6_2 for package: systemtap-1.6-5.el6_2.i686 --> Running transaction check ---> Package gcc.i686 0:4.4.6-3.el6 will be installed --> Processing Dependency: libgomp = 4.4.6-3.el6 for package: gcc-4.4.6-3.el6.i686 ---> Package gcc-c++.i686 0:4.4.6-3.el6 will be installed --> Processing Dependency: libstdc++ = 4.4.6-3.el6 for package: gcc-c++-4.4.6-3.el6.i686 ---> Package gcc-gfortran.i686 0:4.4.6-3.el6 will be installed --> Processing Dependency: libgfortran = 4.4.6-3.el6 for package: gcc-gfortran-4.4.6-3.el6.i686 ---> Package glibc-devel.i686 0:2.12-1.47.el6_2.12 will be installed --> Processing Dependency: glibc = 2.12-1.47.el6_2.12 for package: glibc-devel-2.12-1.47.el6_2.12.i686 ---> Package glibc-headers.i686 0:2.12-1.47.el6_2.12 will be installed --> Processing Dependency: glibc = 2.12-1.47.el6_2.12 for package: glibc-headers-2.12-1.47.el6_2.12.i686 ---> Package kernel-headers.i686 0:2.6.32-220.17.1.el6 will be installed ---> Package libart_lgpl.i686 0:2.3.20-5.1.el6 will be installed ---> Package libproxy-bin.i686 0:0.3.0-2.el6 will be installed ---> Package libproxy-python.i686 0:0.3.0-2.el6 will be installed ---> Package libstdc++-devel.i686 0:4.4.6-3.el6 will be installed --> Processing Dependency: libstdc++(x86-32) = 4.4.6-3.el6 for package: libstdc++-devel-4.4.6-3.el6.i686 ---> Package rpm-build.i686 0:4.8.0-19.el6_2.1 will be installed --> Processing Dependency: rpm = 4.8.0-19.el6_2.1 for package: rpm-build-4.8.0-19.el6_2.1.i686 ---> Package systemtap.i686 0:1.6-5.el6_2 will be installed --> Processing Dependency: systemtap-runtime = 1.6-5.el6_2 for package: systemtap-1.6-5.el6_2.i686 --> Finished Dependency Resolution You could try using --skip-broken to work around the problem You could try running: rpm -Va --nofiles --nodigest
# checking possible sys update
Loaded plugins: amazon-id, product-id, rhui-lb, security, subscription-manager
Updating certificate-based repositories.
# no sys update found
######################################################################################
# NEW TEST: ## Verify yum update ... 
######################################################################################
COMMAND:  /usr/bin/yum -y update
Unable to read consumer identity
RESULT: Loaded plugins: amazon-id, product-id, rhui-lb, security, subscription-manager
Updating certificate-based repositories.
Setting up Update Process
Resolving Dependencies
--> Running transaction check
---> Package dmidecode.i686 1:2.11-2.el6 will be updated
---> Package dmidecode.i686 1:2.11-2.el6_1 will be an update
---> Package java-1.6.0-openjdk.i686 1:1.6.0.0-1.45.1.11.1.el6 will be updated
---> Package java-1.6.0-openjdk.i686 1:1.6.0.0-1.48.1.11.3.el6_2 will be an update
---> Package perl-Compress-Raw-Bzip2.i686 0:2.020-127.el6 will be updated
---> Package perl-Compress-Raw-Bzip2.i686 0:2.027-1.el6 will be an update
--> Finished Dependency Resolution

Dependencies Resolved

================================================================================
 Package    Arch Version         Repository                                Size
================================================================================
Updating:
 dmidecode  i686 1:2.11-2.el6_1  rhui-ap-southeast-1-rhel-server-releases  70 k
 java-1.6.0-openjdk
            i686 1:1.6.0.0-1.48.1.11.3.el6_2
                                 rhui-ap-southeast-1-rhel-server-releases  26 M
 perl-Compress-Raw-Bzip2
            i686 2.027-1.el6     epel                                      30 k

Transaction Summary
================================================================================
Upgrade       3 Package(s)

Total download size: 26 M
Downloading Packages:
--------------------------------------------------------------------------------
Total                                           6.4 MB/s |  26 MB     00:04     
Running rpm_check_debug
Running Transaction Test
Transaction Test Succeeded
Running Transaction

  Updating   : perl-Compress-Raw-Bzip2-2.027-1.el6.i686                     1/6 

  Updating   : 1:dmidecode-2.11-2.el6_1.i686                                2/6 

  Updating   : 1:java-1.6.0-openjdk-1.6.0.0-1.48.1.11.3.el6_2.i686          3/6 

  Cleanup    : 1:dmidecode-2.11-2.el6.i686                                  4/6 

  Cleanup    : perl-Compress-Raw-Bzip2-2.020-127.el6.i686                   5/6 

  Cleanup    : 1:java-1.6.0-openjdk-1.6.0.0-1.45.1.11.1.el6.i686            6/6 
Installed products updated.

  Verifying  : 1:java-1.6.0-openjdk-1.6.0.0-1.48.1.11.3.el6_2.i686          1/6 

  Verifying  : perl-Compress-Raw-Bzip2-2.027-1.el6.i686                     2/6 

  Verifying  : 1:dmidecode-2.11-2.el6_1.i686                                3/6 

  Verifying  : 1:dmidecode-2.11-2.el6.i686                                  4/6 

  Verifying  : 1:java-1.6.0-openjdk-1.6.0.0-1.45.1.11.1.el6.i686            5/6 

  Verifying  : perl-Compress-Raw-Bzip2-2.020-127.el6.i686                   6/6 

Updated:
  dmidecode.i686 1:2.11-2.el6_1                                                 
  java-1.6.0-openjdk.i686 1:1.6.0.0-1.48.1.11.3.el6_2                           
  perl-Compress-Raw-Bzip2.i686 0:2.027-1.el6                                    

Complete! 
EXPECTED RESULT: 
RETURN CODE: 0
PASS
######################################################################################
# NEW TEST: ## Verify no fa1lures in rpm package ... 
######################################################################################
COMMAND:  cat /root/valid/src/validate.log | grep 'failure in rpm package' | wc -l
RESULT: 1 
EXPECTED RESULT: 1
RETURN CODE: 0
PASS
######################################################################################
# NEW TEST: ## Verify no rpm scriplet fa1lures ... 
######################################################################################
COMMAND:  cat /root/valid/src/validate.log | grep 'scriptlet failed, exit status 1' | wc -l
RESULT: 1 
EXPECTED RESULT: 1
RETURN CODE: 0
PASS
######################################################################################
# NEW TEST: ## Verify package removal... 
######################################################################################
COMMAND: /bin/rpm -e zsh
RETURN CODE: 0
COMMAND:  /bin/rpm -q zsh
RESULT: package zsh is not installed 
EXPECTED RESULT: package zsh is not installed
RETURN CODE: 1
PASS
######################################################################################
# NEW TEST: ## install zsh ... 
######################################################################################
COMMAND: /usr/bin/yum -y install zsh
Unable to read consumer identity
Warning: RPMDB altered outside of yum.
RETURN CODE: 0
COMMAND:  /bin/rpm -q --queryformat '%{NAME}\n' zsh
RESULT: zsh 
EXPECTED RESULT: zsh
RETURN CODE: 0
PASS
######################################################################################
# NEW TEST: ## Verify package removal ... 
######################################################################################
COMMAND: /bin/rpm -e zsh
RETURN CODE: 0
COMMAND:  /bin/rpm -q zsh
RESULT: package zsh is not installed 
EXPECTED RESULT: package zsh is not installed
RETURN CODE: 1
PASS
# checking possible sys update
Loaded plugins: amazon-id, product-id, rhui-lb, security, subscription-manager
Updating certificate-based repositories.
# no sys update found
######################################################################################
# NEW TEST: ## Verify yum update ... 
######################################################################################
COMMAND:  /usr/bin/yum -y update
Unable to read consumer identity
RESULT: Loaded plugins: amazon-id, product-id, rhui-lb, security, subscription-manager
Updating certificate-based repositories.
Setting up Update Process
No Packages marked for Update 
EXPECTED RESULT: 
RETURN CODE: 0
PASS
######################################################################################
# NEW TEST: ## Verify disabled yum plugin ... 
######################################################################################
COMMAND:  grep ^enabled /etc/yum/pluginconf.d/rhnplugin.conf | grep -v '^#' | cut -d\= -f2 | awk '{print }' | sort -f | uniq
RESULT:  0 
EXPECTED RESULT: 
RETURN CODE: 0
PASS

## Summary ##
FAILURES = 1
FAILED TESTS = ## Install Development tools group...
LOG FILE = /root/valid/src/validate.log
## Summary ##

######################################################################################
# NEW TEST: ## Open a bugzilla
######################################################################################
Comment 7 mkovacik 2012-06-18 04:13:36 EDT
IMAGE ID= ami-28d6907a_ap-southeast-1_c1.medium
###### TEST KERNEL AFTER REBOOT ####  
######################################################################################
# NEW TEST: ## Verify disabled yum plugin ... 
######################################################################################
COMMAND:  grep ^enabled /etc/yum/pluginconf.d/rhnplugin.conf | grep -v '^#' | cut -d\= -f2 | awk '{print }' | sort -f | uniq
RESULT:  0 
EXPECTED RESULT: 
RETURN CODE: 0
PASS
######################################################################################
# NEW TEST: ## Verify kernel name ... 
######################################################################################
COMMAND:  /bin/uname -s
RESULT: Linux 
EXPECTED RESULT: Linux
RETURN CODE: 0
PASS
######################################################################################
# NEW TEST: ## Verify latest installed kernel is running ... 
######################################################################################
Detected rpm kernel version: 2.6.32-276.el6.i686
Detected uname kernel version: 2.6.32-276.el6.i686
COMMAND:  true
RESULT:  
EXPECTED RESULT: 
RETURN CODE: 0
PASS
######################################################################################
# NEW TEST: ## Verify latest kenerl is in /boot/grub/menu.1st ... 
######################################################################################
COMMAND:  cat /boot/grub/menu.lst | grep 2.6.32-276.el6.i686
RESULT: title RHEL6.3-20120531.0-Server-i386-starter-ec2 (2.6.32-276.el6.i686)
        kernel /boot/vmlinuz-2.6.32-276.el6.i686 ro root=LABEL=_/ 
        initrd /boot/initramfs-2.6.32-276.el6.i686.img 
EXPECTED RESULT: 
RETURN CODE: 0
PASS
######################################################################################
# NEW TEST: ## Verify operating system ... 
######################################################################################
COMMAND:  /bin/uname -o
RESULT: GNU/Linux 
EXPECTED RESULT: GNU/Linux
RETURN CODE: 0
PASS
######################################################################################
# NEW TEST: ## Verify /etc/sysconfig/kernel ... 
######################################################################################
COMMAND:  ls /etc/sysconfig/kernel
RESULT: /etc/sysconfig/kernel 
EXPECTED RESULT: 
RETURN CODE: 0
PASS
######################################################################################
# NEW TEST: ## Verify /etc/sysconfig/kernel contains UPDATEDEFAULT ... 
######################################################################################
COMMAND:  cat /etc/sysconfig/kernel | grep UPDATEDEFAULT=yes
RESULT: UPDATEDEFAULT=yes 
EXPECTED RESULT: 
RETURN CODE: 0
PASS
######################################################################################
# NEW TEST: ## Verify /etc/sysconfig/kernel contains DEFAULTKERNEL ... 
######################################################################################
COMMAND:  cat /etc/sysconfig/kernel | grep DEFAULTKERNEL=kernel
RESULT: DEFAULTKERNEL=kernel 
EXPECTED RESULT: 
RETURN CODE: 0
PASS
######################################################################################
# NEW TEST: ## Verify system up to date
######################################################################################
COMMAND:  _check_sys_update_phase1
# no update was required
RESULT: # checking sys update done
# no update was required 
EXPECTED RESULT: 
RETURN CODE: 0
PASS
######################################################################################
# NEW TEST: ##Verify memory match hwp ... 
######################################################################################
cat /proc/meminfo | grep MemTotal: | awk '{print }'
FOUND MEMORY OF 1752696 > hwp MEMORY of 1700000
COMMAND:  echo true
RESULT: true 
EXPECTED RESULT: 
RETURN CODE: 0
PASS
hostname
######################################################################################
# NEW TEST: The selected image has the version RHEL 6.3
######################################################################################

## Summary ##
FAILURES = 1
FAILED TESTS = ## Install Development tools group...
LOG FILE = /root/valid/src/validate.log
## Summary ##

######################################################################################
# NEW TEST: ## Open a bugzilla
######################################################################################
Comment 8 mkovacik 2012-06-18 04:13:37 EDT
IMAGE ID= 
Preparing...                ##################################################
epel-release                ##################################################
Loaded plugins: amazon-id, product-id, rhui-lb, security, subscription-manager
Updating certificate-based repositories.
Setting up Install Process
Resolving Dependencies
--> Running transaction check
---> Package python-bugzilla.noarch 0:0.6.0-1.el6 will be installed
--> Finished Dependency Resolution

Dependencies Resolved

================================================================================
 Package                 Arch           Version              Repository    Size
================================================================================
Installing:
 python-bugzilla         noarch         0.6.0-1.el6          epel          71 k

Transaction Summary
================================================================================
Install       1 Package(s)

Total download size: 71 k
Installed size: 309 k
Downloading Packages:
Retrieving key from file:///etc/pki/rpm-gpg/RPM-GPG-KEY-EPEL-6
Running rpm_check_debug
Running Transaction Test
Transaction Test Succeeded
Running Transaction

  Installing : python-bugzilla-0.6.0-1.el6.noarch                           1/1 
Installed products updated.

  Verifying  : python-bugzilla-0.6.0-1.el6.noarch                           1/1 

Installed:
  python-bugzilla.noarch 0:0.6.0-1.el6                                          

Complete!
=====image_validation.sh Mon Jun 18 04:06:24 EDT 2012=====
######################################################################################
# NEW TEST: ## Open a bugzilla
######################################################################################
######################################################################################
# NEW TEST: Fetching the identity doc Details
######################################################################################
Verifying that signature exists
COMMAND:  echo 1
RESULT: 1 
EXPECTED RESULT: 1
RETURN CODE: 0
PASS
Verifying the IMAGE ID
COMMAND:  echo 1
RESULT: 1 
EXPECTED RESULT: 1
RETURN CODE: 0
PASS
Verifying the Architecture
COMMAND:  echo 1
RESULT: 1 
EXPECTED RESULT: 1
RETURN CODE: 0
PASS
This Host => ec2-122-248-219-114.ap-southeast-1.compute.amazonaws.com with Image Id : ami-28d6907a, is launched with Instance Id : i-400d9d14 , Instance Type : t1.micro and Arch : i386 in the Region : ap-southeast-1a
The Validate Signature is : CWA3h25142SlZiTmJIefAEYew76baTBIjW1/3mQOJGA3BqZp3sdkAXJesK5cK64DsR8wIsN2YV8l
5Q7i4tyVHLYccmqiepKYb0vIY32L/eVvEgIg3jnVP3crjW0xUz+T+tqKWoGjoHiBBUv5qCIrC3dL
gNykIbDU5w0e12ql3g8=
This is a Cloud Access image
/root/valid/src
ip-10-128-90-93
Red Hat Enterprise Linux Server release 6.3 (Santiago)
######################################################################################
# NEW TEST: The selected image has the version RHEL 6.3
######################################################################################
######################################################################################
# NEW TEST: ## Verify auditd is on ... 
######################################################################################
COMMAND:  /sbin/chkconfig --list auditd | grep 3:on
RESULT: auditd         	0:off	1:off	2:on	3:on	4:on	5:on	6:off 
EXPECTED RESULT: 
RETURN CODE: 0
PASS
COMMAND:  /sbin/chkconfig --list auditd | grep 5:on
RESULT: auditd         	0:off	1:off	2:on	3:on	4:on	5:on	6:off 
EXPECTED RESULT: 
RETURN CODE: 0
PASS
######################################################################################
# NEW TEST: ## Verify audit.rules ... 
######################################################################################
COMMAND:  md5sum /etc/audit/audit.rules | cut -f 1 -d  " "
RESULT: f9869e1191838c461f5b9051c78a638d 
EXPECTED RESULT: f9869e1191838c461f5b9051c78a638d
RETURN CODE: 0
PASS
######################################################################################
# NEW TEST: ## Verify auditd.conf ... 
######################################################################################
COMMAND:  md5sum /etc/audit/auditd.conf | cut -f 1 -d  " "
RESULT: e1886162554c18906df2ecd258aa4794 
EXPECTED RESULT: e1886162554c18906df2ecd258aa4794
RETURN CODE: 0
PASS
######################################################################################
# NEW TEST: ## Verify auditd sysconfig ... 
######################################################################################
COMMAND:  md5sum /etc/sysconfig/auditd | cut -f 1 -d  " "
RESULT: d4d43637708e30418c30003e212f76fc 
EXPECTED RESULT: d4d43637708e30418c30003e212f76fc
RETURN CODE: 0
PASS
######################################################################################
# NEW TEST: ## Verify bash_history ... 
######################################################################################
COMMAND:  cat ~/.bash_history | wc -l 
cat: /root/.bash_history: No such file or directory
RESULT: 0 
EXPECTED RESULT: 0
RETURN CODE: 0
PASS
######################################################################################
# NEW TEST: ## Verify  chkconfig ... 
######################################################################################
COMMAND:  chkconfig --list | grep crond | cut -f 5
RESULT: 3:on 
EXPECTED RESULT: 3:on
RETURN CODE: 0
PASS
COMMAND:  chkconfig --list | grep  iptables | cut -f 5
RESULT: 3:on 
EXPECTED RESULT: 3:on
RETURN CODE: 0
PASS
######################################################################################
# NEW TEST: ## Verify rh-cloud-firstboot is OFF ... 
######################################################################################
COMMAND:  chkconfig --list | grep rh-cloud | grep 3:off | wc -l
RESULT: 1 
EXPECTED RESULT: 1
RETURN CODE: 0
PASS
/etc/sysconfig/rh-cloud-firstboot FOUND
COMMAND:  echo true
RESULT: true 
EXPECTED RESULT: 
RETURN CODE: 0
PASS
COMMAND:  cat /etc/sysconfig/rh-cloud-firstboot
RESULT: RUN_FIRSTBOOT=NO 
EXPECTED RESULT: RUN_FIRSTBOOT=NO
RETURN CODE: 0
PASS
######################################################################################
# NEW TEST: ## Partition Format  ...
######################################################################################
mount | grep /dev/xvde1 | awk '{ print  }'
COMMAND:  echo ext4
RESULT: ext4 
EXPECTED RESULT: ext4
RETURN CODE: 0
PASS
######################################################################################
# NEW TEST: ## Partition Size ...
######################################################################################
size=5905712
COMMAND:  echo true
RESULT: true 
EXPECTED RESULT: true
RETURN CODE: 0
PASS
######################################################################################
# NEW TEST: Fetching the identity doc Details
######################################################################################
Verifying that signature exists
COMMAND:  echo 1
RESULT: 1 
EXPECTED RESULT: 1
RETURN CODE: 0
PASS
Verifying the IMAGE ID
COMMAND:  echo 1
RESULT: 1 
EXPECTED RESULT: 1
RETURN CODE: 0
PASS
Verifying the Architecture
COMMAND:  echo 1
RESULT: 1 
EXPECTED RESULT: 1
RETURN CODE: 0
PASS
This Host => ec2-122-248-219-114.ap-southeast-1.compute.amazonaws.com with Image Id : ami-28d6907a, is launched with Instance Id : i-400d9d14 , Instance Type : t1.micro and Arch : i386 in the Region : ap-southeast-1a
The Validate Signature is : CWA3h25142SlZiTmJIefAEYew76baTBIjW1/3mQOJGA3BqZp3sdkAXJesK5cK64DsR8wIsN2YV8l
5Q7i4tyVHLYccmqiepKYb0vIY32L/eVvEgIg3jnVP3crjW0xUz+T+tqKWoGjoHiBBUv5qCIrC3dL
gNykIbDU5w0e12ql3g8=
This is a Cloud Access image
######################################################################################
# NEW TEST: ## Verify GPG checking ... 
######################################################################################
COMMAND:  grep '^gpgcheck=1' /etc/yum.repos.d/redhat-*.repo | cut -d\= -f2 | sort -f | uniq
RESULT: 1 
EXPECTED RESULT: 1
RETURN CODE: 0
PASS
######################################################################################
# NEW TEST: ## Verify GPG RPMS ... 
######################################################################################
COMMAND:  rpm -qa gpg-pubkey* | grep -o -F gpg-pubkey-2fa658e0-45700c69
RESULT: gpg-pubkey-2fa658e0-45700c69 
EXPECTED RESULT: gpg-pubkey-2fa658e0-45700c69
RETURN CODE: 0
PASS
COMMAND:  rpm -qa gpg-pubkey* | grep -o -F gpg-pubkey-fd431d51-4ae0493b
RESULT: gpg-pubkey-fd431d51-4ae0493b 
EXPECTED RESULT: gpg-pubkey-fd431d51-4ae0493b
RETURN CODE: 0
PASS
######################################################################################
# NEW TEST: ## Verify group file ... 
######################################################################################
COMMAND:  cat /etc/group | grep root:x:0
RESULT: root:x:0: 
EXPECTED RESULT: root:x:0:
RETURN CODE: 0
PASS
COMMAND:  cat /etc/group | grep daemon:x:2
RESULT: daemon:x:2:bin,daemon 
EXPECTED RESULT: daemon:x:2:bin,daemon
RETURN CODE: 0
PASS
COMMAND:  cat /etc/group | grep bin:x:1
RESULT: bin:x:1:bin,daemon 
EXPECTED RESULT: bin:x:1:bin,daemon
RETURN CODE: 0
PASS
COMMAND:  cat /etc/group | grep nobody:x:99
RESULT: nobody:x:99: 
EXPECTED RESULT: nobody:x:99:
RETURN CODE: 0
PASS
######################################################################################
# NEW TEST: ##test menu.lst ... 
######################################################################################
COMMAND:  file /boot/grub/menu.lst  | grep symbolic | wc -l
RESULT: 1 
EXPECTED RESULT: 1
RETURN CODE: 0
PASS
COMMAND:  file /boot/grub/menu.lst  | grep grub.conf | wc -l
RESULT: 1 
EXPECTED RESULT: 1
RETURN CODE: 0
PASS
COMMAND:  cat /boot/grub/grub.conf  | grep "(hd0,0)" | wc -l
RESULT: 0 
EXPECTED RESULT: 0
RETURN CODE: 0
PASS
######################################################################################
# NEW TEST: ## Verify runlevel ... 
######################################################################################
COMMAND:  cat /etc/inittab | grep id:
RESULT: id:3:initdefault: 
EXPECTED RESULT: id:3:initdefault:
RETURN CODE: 0
PASS
######################################################################################
# NEW TEST: ## Verify iptables ... 
######################################################################################
COMMAND: /etc/init.d/iptables status | grep REJECT 
5    REJECT     all  --  0.0.0.0/0            0.0.0.0/0           reject-with icmp-host-prohibited 
1    REJECT     all  --  0.0.0.0/0            0.0.0.0/0           reject-with icmp-host-prohibited 
RETURN CODE: 0
COMMAND:  /etc/init.d/iptables status | grep :22 | grep ACCEPT | wc -l 
RESULT: 1 
EXPECTED RESULT: 1
RETURN CODE: 0
PASS
######################################################################################
# NEW TEST: ## Verify /etc/ld.so.conf.d/libc6-xen.conf is not present ... 
######################################################################################
COMMAND:  ls /etc/ld.so.conf.d/libc6-xen.conf
ls: cannot access /etc/ld.so.conf.d/libc6-xen.conf: No such file or directory
RESULT:  
EXPECTED RESULT: 2
RETURN CODE: 2
PASS
######################################################################################
# NEW TEST: ##Verify memory match hwp ... 
######################################################################################
cat /proc/meminfo | grep MemTotal: | awk '{print }'
FOUND MEMORY OF 610340 > hwp MEMORY of 600000
COMMAND:  echo true
RESULT: true 
EXPECTED RESULT: 
RETURN CODE: 0
PASS
######################################################################################
# NEW TEST: ## Verify nameserver ... 
######################################################################################
COMMAND:  /usr/bin/dig clock.redhat.com 2>> /root/valid/src/validate.log | grep 66.187.233.4  | wc -l
RESULT: 1 
EXPECTED RESULT: 
RETURN CODE: 0
PASS
######################################################################################
# NEW TEST: ## Verify networking ... 
######################################################################################
COMMAND:  grep ^NETWORKING= /etc/sysconfig/network | cut -d\= -f2
RESULT: yes 
EXPECTED RESULT: yes
RETURN CODE: 0
PASS
######################################################################################
# NEW TEST: ## Verify device ... 
######################################################################################
COMMAND:  grep ^DEVICE= /etc/sysconfig/network-scripts/ifcfg-eth0 | cut -d\= -f2
RESULT: eth0 
EXPECTED RESULT: eth0
RETURN CODE: 0
PASS
######################################################################################
# NEW TEST: ## Verify no missing packages ... 
######################################################################################
COMMAND: /bin/rpm -qa --queryformat='%{NAME}\n' > /tmp/rpmqa.tmp
RETURN CODE: 0
COMMAND: comm -23 packages_63 /tmp/rpmqa
RETURN CODE: 0
COUNT = 0
COMMAND:  echo test passed
RESULT: test passed 
EXPECTED RESULT: 0
RETURN CODE: 0
PASS
######################################################################################
# NEW TEST: ## Verify new passwd file ... 
######################################################################################
COMMAND:  cat /etc/passwd | grep root:x:0
RESULT: root:x:0:0:root:/root:/bin/bash 
EXPECTED RESULT: root:x:0:0:root:/root:/bin/bash
RETURN CODE: 0
PASS
COMMAND:  cat /etc/passwd | grep nobody:x:99
RESULT: nobody:x:99:99:Nobody:/:/sbin/nologin 
EXPECTED RESULT: nobody:x:99:99:Nobody:/:/sbin/nologin
RETURN CODE: 0
PASS
COMMAND:  cat /etc/passwd | grep sshd
RESULT: sshd:x:74:74:Privilege-separated SSH:/var/empty/sshd:/sbin/nologin 
EXPECTED RESULT: sshd:x:74:74:Privilege-separated SSH:/var/empty/sshd:/sbin/nologin
RETURN CODE: 0
PASS
######################################################################################
# NEW TEST: ## test repo files ... 
######################################################################################
COMMAND:  ls -I 'epel*'  /etc/yum.repos.d/ | wc -l 
RESULT: 4 
EXPECTED RESULT: 4
RETURN CODE: 0
PASS
COMMAND:  ls /etc/yum.repos.d/redhat* | wc -l
RESULT: 2 
EXPECTED RESULT: 2
RETURN CODE: 0
PASS
COMMAND:  ls /etc/yum.repos.d/rhel* | wc -l
RESULT: 1 
EXPECTED RESULT: 0
RETURN CODE: 0
PASS
######################################################################################
# NEW TEST: ## Verify resize2fs ... 
######################################################################################
COMMAND: resize2fs -p /dev/xvde1 15000M
resize2fs 1.41.12 (17-May-2010)
RETURN CODE: 0
COMMAND:  df -h | grep 15G | wc -l 
RESULT: 1 
EXPECTED RESULT: 1
RETURN CODE: 0
PASS
/root/valid/src
ip-10-128-90-93
Red Hat Enterprise Linux Server release 6.3 (Santiago)
######################################################################################
# NEW TEST: The selected image has the version RHEL 6.3
######################################################################################
######################################################################################
# NEW TEST: ## /sbin/getenforce ... 
######################################################################################
COMMAND:  /usr/sbin/getenforce
RESULT: Enforcing 
EXPECTED RESULT: Enforcing
RETURN CODE: 0
PASS
######################################################################################
# NEW TEST: ## Verify SELINUX enforcing ... 
######################################################################################
COMMAND:  grep ^SELINUX= /etc/sysconfig/selinux | cut -d\= -f2
RESULT: enforcing 
EXPECTED RESULT: enforcing
RETURN CODE: 0
PASS
######################################################################################
# NEW TEST: ## Verify SELINUXTYPE targeted ... 
######################################################################################
COMMAND:  grep ^SELINUXTYPE= /etc/sysconfig/selinux | cut -d\= -f2
RESULT: targeted 
EXPECTED RESULT: targeted
RETURN CODE: 0
PASS
######################################################################################
# NEW TEST: ## Flip Selinux Permissive ... 
######################################################################################
COMMAND:  /usr/sbin/setenforce Permissive && /usr/sbin/getenforce
RESULT: Permissive 
EXPECTED RESULT: Permissive
RETURN CODE: 0
PASS
######################################################################################
# NEW TEST: ## Flip Selinux Enforcing ... 
######################################################################################
COMMAND:  /usr/sbin/setenforce Enforcing && /usr/sbin/getenforce
RESULT: Enforcing 
EXPECTED RESULT: Enforcing
RETURN CODE: 0
PASS
######################################################################################
# NEW TEST: ## Verify new shells file ... 
######################################################################################
COMMAND:  cat /etc/shells | grep bash
RESULT: /bin/bash 
EXPECTED RESULT: /bin/bash
RETURN CODE: 0
PASS
COMMAND:  cat /etc/shells | grep nologin
RESULT: /sbin/nologin 
EXPECTED RESULT: /sbin/nologin
RETURN CODE: 0
PASS
######################################################################################
# NEW TEST: ## Verify sshd_config settings ...
######################################################################################
COMMAND:  cat /etc/ssh/sshd_config  | grep  PasswordAuthentication | grep no | wc -l
RESULT: 1 
EXPECTED RESULT: 1
RETURN CODE: 0
PASS
######################################################################################
# NEW TEST: ## Verify sshd ...
######################################################################################
COMMAND:  chkconfig --list | grep sshd
RESULT: sshd           	0:off	1:off	2:on	3:on	4:on	5:on	6:off 
EXPECTED RESULT: sshd           	0:off	1:off	2:on	3:on	4:on	5:on	6:off
RETURN CODE: 0
PASS
COMMAND:  /etc/init.d/sshd status | grep running | wc -l
RESULT: 1 
EXPECTED RESULT: 1
RETURN CODE: 0
PASS
this machine doesn't require swap
######################################################################################
# NEW TEST: ## Verify rsyslog is on ... 
######################################################################################
COMMAND:  chkconfig --list | grep rsyslog | cut -f 5
RESULT: 3:on 
EXPECTED RESULT: 3:on
RETURN CODE: 0
PASS
######################################################################################
# NEW TEST: ## Verify rsyslog config ... 
######################################################################################
COMMAND:  md5sum /etc/rsyslog.conf | cut -f 1 -d  " "
RESULT: 8b91b32300134e98ef4aee632ed61e21 
EXPECTED RESULT: 8b91b32300134e98ef4aee632ed61e21
RETURN CODE: 0
PASS
######################################################################################
# NEW TEST: ## Verify no systemid file ... 
######################################################################################
COMMAND:  echo true
RESULT: true 
EXPECTED RESULT: 
RETURN CODE: 0
PASS
######################################################################################
# NEW TEST: ## Verify kernel name ... 
######################################################################################
COMMAND:  /bin/uname -s
RESULT: Linux 
EXPECTED RESULT: Linux
RETURN CODE: 0
PASS
######################################################################################
# NEW TEST: ## Verify latest installed kernel is running ... 
######################################################################################
Detected rpm kernel version: 2.6.32-276.el6.i686
Detected uname kernel version: 2.6.32-276.el6.i686
Comment 9 mkovacik 2012-06-18 04:13:45 EDT
COMMAND:  true
RESULT:  
EXPECTED RESULT: 
RETURN CODE: 0
PASS
######################################################################################
# NEW TEST: ## Verify latest kenerl is in /boot/grub/menu.1st ... 
######################################################################################
COMMAND:  cat /boot/grub/menu.lst | grep 2.6.32-276.el6.i686
RESULT: title RHEL6.3-20120531.0-Server-i386-starter-ec2 (2.6.32-276.el6.i686)
        kernel /boot/vmlinuz-2.6.32-276.el6.i686 ro root=LABEL=_/ 
        initrd /boot/initramfs-2.6.32-276.el6.i686.img 
EXPECTED RESULT: 
RETURN CODE: 0
PASS
######################################################################################
# NEW TEST: ## Verify operating system ... 
######################################################################################
COMMAND:  /bin/uname -o
RESULT: GNU/Linux 
EXPECTED RESULT: GNU/Linux
RETURN CODE: 0
PASS
######################################################################################
# NEW TEST: ## Verify /etc/sysconfig/kernel ... 
######################################################################################
COMMAND:  ls /etc/sysconfig/kernel
RESULT: /etc/sysconfig/kernel 
EXPECTED RESULT: 
RETURN CODE: 0
PASS
######################################################################################
# NEW TEST: ## Verify /etc/sysconfig/kernel contains UPDATEDEFAULT ... 
######################################################################################
COMMAND:  cat /etc/sysconfig/kernel | grep UPDATEDEFAULT=yes
RESULT: UPDATEDEFAULT=yes 
EXPECTED RESULT: 
RETURN CODE: 0
PASS
######################################################################################
# NEW TEST: ## Verify /etc/sysconfig/kernel contains DEFAULTKERNEL ... 
######################################################################################
COMMAND:  cat /etc/sysconfig/kernel | grep DEFAULTKERNEL=kernel
RESULT: DEFAULTKERNEL=kernel 
EXPECTED RESULT: 
RETURN CODE: 0
PASS
######################################################################################
# NEW TEST: ## Verify system up to date
######################################################################################
COMMAND:  _check_sys_update_phase1
# no update was required
RESULT: # checking sys update done
# no update was required 
EXPECTED RESULT: 
RETURN CODE: 0
PASS
######################################################################################
# NEW TEST: ## Verify RPMs ... 
######################################################################################
....L....  c /etc/pam.d/fingerprint-auth
....L....  c /etc/pam.d/password-auth
....L....  c /etc/pam.d/smartcard-auth
....L....  c /etc/pam.d/system-auth
.M.......    /var/cache/yum
    S file Size differs
    M Mode differs (includes permissions and file type)
    5 MD5 sum differs
    D Device major/minor number mismatch
    L readLink(2) path mismatch
    U User ownership differs
    G Group ownership differs
    T mTime differs

COMMAND:  cat /tmp/rpmqaV.txt | wc -l
RESULT: 5 
EXPECTED RESULT: 5
RETURN CODE: 0
PASS
######################################################################################
# NEW TEST: ## Verify Version 2 ... 
######################################################################################
COMMAND:  /bin/rpm -q --queryformat '%{RELEASE}\n' redhat-release-server | cut -d. -f1,2
RESULT: 6.3 
EXPECTED RESULT: 6.3
RETURN CODE: 0
PASS
######################################################################################
# NEW TEST: ## Verify packager ... 
######################################################################################
COMMAND:  cat /tmp/Packager | grep -v 'Red Hat, Inc.' |  grep -v crash-trace-commandPackager| wc -l
RESULT: 2 
EXPECTED RESULT: 0
RETURN CODE: 0
PASS
crash-trace-commandPackager    : Lai Jiangshan <laijs@cn.fujitsu.com>
epel-releasePackager    : Fedora Project
python-bugzillaPackager    : Fedora Project
######################################################################################
# NEW TEST: ## List the configured repositories...
######################################################################################
COMMAND:  /usr/bin/yum repolist
Unable to read consumer identity
RESULT: Loaded plugins: amazon-id, product-id, rhui-lb, security, subscription-manager
Updating certificate-based repositories.
repo id                                           repo name               status
epel                                              Extra Packages for Ente 6,111
rhui-ap-southeast-1-client-config-server-6        Red Hat Update Infrastr     1
rhui-ap-southeast-1-rhel-server-releases          Red Hat Enterprise Linu 5,587
rhui-ap-southeast-1-rhel-server-releases-optional Red Hat Enterprise Linu 3,344
repolist: 15,043 
EXPECTED RESULT: 
RETURN CODE: 0
PASS
######################################################################################
# NEW TEST: ## Search zsh...
######################################################################################
COMMAND:  /usr/bin/yum search zsh
Unable to read consumer identity
RESULT: Loaded plugins: amazon-id, product-id, rhui-lb, security, subscription-manager
Updating certificate-based repositories.
=============================== N/S Matched: zsh ===============================
autojump-zsh.noarch : Autojump for zsh
gromacs-zsh.noarch : GROMACS zsh support
python-twisted-core-zsh.i686 : Tab completion for Zsh and Twisted Core
zsh-html.i686 : Zsh shell manual in html format
zsh.i686 : A powerful interactive shell

  Name and summary matches only, use "search all" for everything. 
EXPECTED RESULT: 
RETURN CODE: 0
PASS
######################################################################################
# NEW TEST: ## install zsh ... 
######################################################################################
COMMAND: /usr/bin/yum -y install zsh
Unable to read consumer identity
RETURN CODE: 0
COMMAND:  /bin/rpm -q --queryformat '%{NAME}\n' zsh
RESULT: zsh 
EXPECTED RESULT: zsh
RETURN CODE: 0
PASS
######################################################################################
# NEW TEST: ## List available groups..
######################################################################################
COMMAND:  /usr/bin/yum grouplist
Unable to read consumer identity
RESULT: Loaded plugins: amazon-id, product-id, rhui-lb, security, subscription-manager
Updating certificate-based repositories.
Setting up Group Process
Installed Groups:
   Additional Development
   Base
   Client management tools
   Console internet tools
   Debugging Tools
   Desktop Platform
   Directory Client
   E-mail server
   Fonts
   Graphical Administration Tools
   Hardware monitoring utilities
   Java Platform
   Large Systems Performance
   Legacy UNIX compatibility
   Messaging Client Support
   Messaging Server Support
   Milkymist
   NFS file server
   Network file system client
   Networking Tools
   Performance Tools
   Perl Support
   Scientific support
   Server Platform
Installed Language Groups:
   Arabic Support [ar]
   Armenian Support [hy]
   Georgian Support [ka]
   Hebrew Support [he]
   Inuktitut Support [iu]
   Japanese Support [ja]
   Korean Support [ko]
   Lao Support [lo]
   Tajik Support [tg]
Available Groups:
   Backup Client
   Backup Server
   CIFS file server
   Compatibility libraries
   Desktop
   Desktop Debugging and Performance Tools
   Desktop Platform Development
   Development tools
   Dial-up Networking Support
   Directory Server
   Eclipse
   Educational Software
   Electronic Lab
   Emacs
   FCoE Storage Client
   FTP server
   Fedora Packager
   General Purpose Desktop
   Graphics Creation Tools
   Haskell
   Identity Management Server
   Infiniband Support
   Input Methods
   Internet Applications
   Internet Browser
   KDE Desktop
   Legacy X Window System compatibility
   Mainframe Access
   MySQL Database client
   MySQL Database server
   Network Infrastructure Server
   Network Storage Server
   Office Suite and Productivity
   PHP Support
   PostgreSQL Database client
   PostgreSQL Database server
   Print Server
   Printing client
   Remote Desktop Clients
   Ruby Support
   SNMP Support
   Security Tools
   Server Platform Development
   Smart card support
   Somali Support
   Storage Availability Tools
   System Management
   System administration tools
   TeX support
   Technical Writing
   TurboGears application framework
   Virtualization
   Virtualization Client
   Virtualization Platform
   Virtualization Tools
   Web Server
   Web Servlet Engine
   Web-Based Enterprise Management
   X Window System
   Xfce
   iSCSI Storage Client
Available Language Groups:
   Afrikaans Support [af]
   Albanian Support [sq]
   Amazigh Support [ber]
   Assamese Support [as]
   Azerbaijani Support [az]
   Basque Support [eu]
   Belarusian Support [be]
   Bengali Support [bn]
   Bhutanese Support [dz]
   Brazilian Portuguese Support [pt_BR]
   Breton Support [br]
   Bulgarian Support [bg]
   Catalan Support [ca]
   Chhattisgarhi Support [hne]
   Chichewa Support [ny]
   Chinese Support [zh]
   Coptic Support [cop]
   Croatian Support [hr]
   Czech Support [cs]
   Danish Support [da]
   Dutch Support [nl]
   English (UK) Support [en_GB]
   Esperanto Support [eo]
   Estonian Support [et]
   Ethiopic Support [am]
   Faroese Support [fo]
   Fijian Support [fj]
   Filipino Support [fil]
   Finnish Support [fi]
   French Support [fr]
   Frisian Support [fy]
   Friulian Support [fur]
   Gaelic Support [gd]
   Galician Support [gl]
   German Support [de]
   Greek Support [el]
   Gujarati Support [gu]
   Hiligaynon Support [hil]
   Hindi Support [hi]
   Hungarian Support [hu]
   Icelandic Support [is]
   Indonesian Support [id]
   Interlingua Support [ia]
   Irish Support [ga]
   Italian Support [it]
   Kannada Support [kn]
   Kashmiri Support [ks]
   Kashubian Support [csb]
   Kazakh Support [kk]
   Khmer Support [km]
   Kinyarwanda Support [rw]
   Konkani Support [kok]
   Kurdish Support [ku]
   Latin Support [la]
   Latvian Support [lv]
   Lithuanian Support [lt]
   Low Saxon Support [nds]
   Luxembourgish Support [lb]
   Macedonian Support [mk]
   Maithili Support [mai]
   Malagasy Support [mg]
   Malay Support [ms]
   Malayalam Support [ml]
   Maltese Support [mt]
   Manx Support [gv]
   Maori Support [mi]
   Marathi Support [mr]
   Mongolian Support [mn]
   Myanmar (Burmese) Support [my]
   Nepali Support [ne]
   Northern Sotho Support [nso]
   Norwegian Support [nb]
   Occitan Support [oc]
   Oriya Support [or]
   Persian Support [fa]
   Polish Support [pl]
   Portuguese Support [pt]
   Punjabi Support [pa]
   Romanian Support [ro]
   Russian Support [ru]
   Sanskrit Support [sa]
   Sardinian Support [sc]
   Serbian Support [sr]
   Sindhi Support [sd]
   Sinhala Support [si]
   Slovak Support [sk]
   Slovenian Support [sl]
   Southern Ndebele Support [nr]
   Southern Sotho Support [st]
   Spanish Support [es]
   Swahili Support [sw]
   Swati Support [ss]
   Swedish Support [sv]
   Tagalog Support [tl]
   Tamil Support [ta]
   Telugu Support [te]
   Tetum Support [tet]
   Thai Support [th]
   Tibetan Support [bo]
   Tsonga Support [ts]
   Tswana Support [tn]
   Turkish Support [tr]
   Turkmen Support [tk]
   Ukrainian Support [uk]
   Upper Sorbian Support [hsb]
   Urdu Support [ur]
   Uzbek Support [uz]
   Venda Support [ve]
   Vietnamese Support [vi]
   Walloon Support [wa]
   Welsh Support [cy]
   Xhosa Support [xh]
   Zulu Support [zu]
Done 
EXPECTED RESULT: 
RETURN CODE: 0
PASS
######################################################################################
# NEW TEST: ## Install Development tools group...
######################################################################################
COMMAND:  /usr/bin/yum -y groupinstall 'Development tools'
Unable to read consumer identity
Error: Package: glibc-devel-2.12-1.47.el6_2.12.i686 (rhui-ap-southeast-1-rhel-server-releases)
           Requires: glibc = 2.12-1.47.el6_2.12
           Installed: glibc-2.12-1.80.el6.i686 (@koji-override-0/$releasever)
               glibc = 2.12-1.80.el6
           Available: glibc-2.12-1.7.el6.i686 (rhui-ap-southeast-1-rhel-server-releases)
               glibc = 2.12-1.7.el6
           Available: glibc-2.12-1.7.el6_0.3.i686 (rhui-ap-southeast-1-rhel-server-releases)
               glibc = 2.12-1.7.el6_0.3
           Available: glibc-2.12-1.7.el6_0.4.i686 (rhui-ap-southeast-1-rhel-server-releases)
               glibc = 2.12-1.7.el6_0.4
           Available: glibc-2.12-1.7.el6_0.5.i686 (rhui-ap-southeast-1-rhel-server-releases)
               glibc = 2.12-1.7.el6_0.5
           Available: glibc-2.12-1.25.el6.i686 (rhui-ap-southeast-1-rhel-server-releases)
               glibc = 2.12-1.25.el6
           Available: glibc-2.12-1.25.el6_1.3.i686 (rhui-ap-southeast-1-rhel-server-releases)
               glibc = 2.12-1.25.el6_1.3
           Available: glibc-2.12-1.47.el6.i686 (rhui-ap-southeast-1-rhel-server-releases)
               glibc = 2.12-1.47.el6
           Available: glibc-2.12-1.47.el6_2.5.i686 (rhui-ap-southeast-1-rhel-server-releases)
               glibc = 2.12-1.47.el6_2.5
           Available: glibc-2.12-1.47.el6_2.9.i686 (rhui-ap-southeast-1-rhel-server-releases)
               glibc = 2.12-1.47.el6_2.9
           Available: glibc-2.12-1.47.el6_2.12.i686 (rhui-ap-southeast-1-rhel-server-releases)
               glibc = 2.12-1.47.el6_2.12
Error: Package: glibc-headers-2.12-1.47.el6_2.12.i686 (rhui-ap-southeast-1-rhel-server-releases)
           Requires: glibc = 2.12-1.47.el6_2.12
           Installed: glibc-2.12-1.80.el6.i686 (@koji-override-0/$releasever)
               glibc = 2.12-1.80.el6
           Available: glibc-2.12-1.7.el6.i686 (rhui-ap-southeast-1-rhel-server-releases)
               glibc = 2.12-1.7.el6
           Available: glibc-2.12-1.7.el6_0.3.i686 (rhui-ap-southeast-1-rhel-server-releases)
               glibc = 2.12-1.7.el6_0.3
           Available: glibc-2.12-1.7.el6_0.4.i686 (rhui-ap-southeast-1-rhel-server-releases)
               glibc = 2.12-1.7.el6_0.4
           Available: glibc-2.12-1.7.el6_0.5.i686 (rhui-ap-southeast-1-rhel-server-releases)
               glibc = 2.12-1.7.el6_0.5
           Available: glibc-2.12-1.25.el6.i686 (rhui-ap-southeast-1-rhel-server-releases)
               glibc = 2.12-1.25.el6
           Available: glibc-2.12-1.25.el6_1.3.i686 (rhui-ap-southeast-1-rhel-server-releases)
               glibc = 2.12-1.25.el6_1.3
           Available: glibc-2.12-1.47.el6.i686 (rhui-ap-southeast-1-rhel-server-releases)
               glibc = 2.12-1.47.el6
           Available: glibc-2.12-1.47.el6_2.5.i686 (rhui-ap-southeast-1-rhel-server-releases)
               glibc = 2.12-1.47.el6_2.5
           Available: glibc-2.12-1.47.el6_2.9.i686 (rhui-ap-southeast-1-rhel-server-releases)
               glibc = 2.12-1.47.el6_2.9
           Available: glibc-2.12-1.47.el6_2.12.i686 (rhui-ap-southeast-1-rhel-server-releases)
               glibc = 2.12-1.47.el6_2.12
Error: Package: rpm-build-4.8.0-19.el6_2.1.i686 (rhui-ap-southeast-1-rhel-server-releases)
           Requires: rpm = 4.8.0-19.el6_2.1
           Installed: rpm-4.8.0-27.el6.i686 (@koji-override-0/$releasever)
               rpm = 4.8.0-27.el6
           Available: rpm-4.8.0-12.el6.i686 (rhui-ap-southeast-1-rhel-server-releases)
               rpm = 4.8.0-12.el6
           Available: rpm-4.8.0-16.el6.i686 (rhui-ap-southeast-1-rhel-server-releases)
               rpm = 4.8.0-16.el6
           Available: rpm-4.8.0-16.el6_1.1.i686 (rhui-ap-southeast-1-rhel-server-releases)
               rpm = 4.8.0-16.el6_1.1
           Available: rpm-4.8.0-19.el6.i686 (rhui-ap-southeast-1-rhel-server-releases)
               rpm = 4.8.0-19.el6
           Available: rpm-4.8.0-19.el6_2.1.i686 (rhui-ap-southeast-1-rhel-server-releases)
               rpm = 4.8.0-19.el6_2.1
Error: Package: gcc-gfortran-4.4.6-3.el6.i686 (rhui-ap-southeast-1-rhel-server-releases)
           Requires: libgfortran = 4.4.6-3.el6
           Installed: libgfortran-4.4.6-4.el6.i686 (@koji-override-0/$releasever)
               libgfortran = 4.4.4-15.el6
               libgfortran = 4.4.6-4.el6
           Available: libgfortran-4.4.4-13.el6.i686 (rhui-ap-southeast-1-rhel-server-releases)
               libgfortran = 4.4.4-13.el6
           Available: libgfortran-4.4.5-6.el6.i686 (rhui-ap-southeast-1-rhel-server-releases)
               libgfortran = 4.4.5-6.el6
               libgfortran = 4.4.4-15.el6
           Available: libgfortran-4.4.6-3.el6.i686 (rhui-ap-southeast-1-rhel-server-releases)
               libgfortran = 4.4.6-3.el6
               libgfortran = 4.4.4-15.el6
Error: Package: gcc-c++-4.4.6-3.el6.i686 (rhui-ap-southeast-1-rhel-server-releases)
           Requires: libstdc++ = 4.4.6-3.el6
           Installed: libstdc++-4.4.6-4.el6.i686 (@koji-override-0/$releasever)
               libstdc++ = 4.4.4-15.el6
               libstdc++ = 4.4.6-4.el6
           Available: libstdc++-4.4.4-13.el6.i686 (rhui-ap-southeast-1-rhel-server-releases)
               libstdc++ = 4.4.4-13.el6
           Available: libstdc++-4.4.5-6.el6.i686 (rhui-ap-southeast-1-rhel-server-releases)
               libstdc++ = 4.4.5-6.el6
               libstdc++ = 4.4.4-15.el6
           Available: libstdc++-4.4.6-3.el6.i686 (rhui-ap-southeast-1-rhel-server-releases)
               libstdc++ = 4.4.6-3.el6
               libstdc++ = 4.4.4-15.el6
Error: Package: libstdc++-devel-4.4.6-3.el6.i686 (rhui-ap-southeast-1-rhel-server-releases)
           Requires: libstdc++(x86-32) = 4.4.6-3.el6
           Installed: libstdc++-4.4.6-4.el6.i686 (@koji-override-0/$releasever)
               libstdc++(x86-32) = 4.4.6-4.el6
           Available: libstdc++-4.4.4-13.el6.i686 (rhui-ap-southeast-1-rhel-server-releases)
               libstdc++(x86-32) = 4.4.4-13.el6
           Available: libstdc++-4.4.5-6.el6.i686 (rhui-ap-southeast-1-rhel-server-releases)
               libstdc++(x86-32) = 4.4.5-6.el6
           Available: libstdc++-4.4.6-3.el6.i686 (rhui-ap-southeast-1-rhel-server-releases)
               libstdc++(x86-32) = 4.4.6-3.el6
Error: Package: systemtap-1.6-5.el6_2.i686 (rhui-ap-southeast-1-rhel-server-releases)
           Requires: systemtap-runtime = 1.6-5.el6_2
           Installed: systemtap-runtime-1.7-5.el6.i686 (@koji-override-0/$releasever)
               systemtap-runtime = 1.7-5.el6
           Available: systemtap-runtime-1.2-9.el6.i686 (rhui-ap-southeast-1-rhel-server-releases)
               systemtap-runtime = 1.2-9.el6
           Available: systemtap-runtime-1.2-11.el6_0.i686 (rhui-ap-southeast-1-rhel-server-releases)
               systemtap-runtime = 1.2-11.el6_0
           Available: systemtap-runtime-1.4-6.el6.i686 (rhui-ap-southeast-1-rhel-server-releases)
               systemtap-runtime = 1.4-6.el6
           Available: systemtap-runtime-1.4-6.el6_1.1.i686 (rhui-ap-southeast-1-rhel-server-releases)
               systemtap-runtime = 1.4-6.el6_1.1
           Available: systemtap-runtime-1.4-6.el6_1.2.i686 (rhui-ap-southeast-1-rhel-server-releases)
               systemtap-runtime = 1.4-6.el6_1.2
           Available: systemtap-runtime-1.4-6.el6_1.3.i686 (rhui-ap-southeast-1-rhel-server-releases)
               systemtap-runtime = 1.4-6.el6_1.3
           Available: systemtap-runtime-1.6-4.el6.i686 (rhui-ap-southeast-1-rhel-server-releases)
               systemtap-runtime = 1.6-4.el6
           Available: systemtap-runtime-1.6-5.el6_2.i686 (rhui-ap-southeast-1-rhel-server-releases)
               systemtap-runtime = 1.6-5.el6_2
Error: Package: gcc-4.4.6-3.el6.i686 (rhui-ap-southeast-1-rhel-server-releases)
           Requires: libgomp = 4.4.6-3.el6
           Installed: libgomp-4.4.6-4.el6.i686 (@koji-override-0/$releasever)
               libgomp = 4.4.4-15.el6
               libgomp = 4.4.6-4.el6
           Available: libgomp-4.4.4-13.el6.i686 (rhui-ap-southeast-1-rhel-server-releases)
               libgomp = 4.4.4-13.el6
           Available: libgomp-4.4.5-6.el6.i686 (rhui-ap-southeast-1-rhel-server-releases)
               libgomp = 4.4.5-6.el6
               libgomp = 4.4.4-15.el6
           Available: libgomp-4.4.6-3.el6.i686 (rhui-ap-southeast-1-rhel-server-releases)
Comment 10 mkovacik 2012-06-18 04:13:55 EDT
               libgomp = 4.4.6-3.el6
               libgomp = 4.4.4-15.el6
RESULT: Loaded plugins: amazon-id, product-id, rhui-lb, security, subscription-manager
Updating certificate-based repositories.
Setting up Group Process
Package matching 1:make-3.81-19.el6.i686 already installed. Checking for update.
Package 1:pkgconfig-0.23-9.1.el6.i686 already installed and latest version
Package gettext-0.17-16.el6.i686 already installed and latest version
Package patch-2.6-6.el6.i686 already installed and latest version
Package matching binutils-2.20.51.0.2-5.28.el6.i686 already installed. Checking for update.
Package elfutils-0.152-1.el6.i686 already installed and latest version
Package cvs-1.11.23-11.el6_2.1.i686 already installed and latest version
Resolving Dependencies
--> Running transaction check
---> Package autoconf.noarch 0:2.63-5.1.el6 will be installed
---> Package automake.noarch 0:1.11.1-1.2.el6 will be installed
---> Package bison.i686 0:2.4.1-5.el6 will be installed
---> Package byacc.i686 0:1.9.20070509-6.1.el6 will be installed
---> Package cscope.i686 0:15.6-6.el6 will be installed
---> Package ctags.i686 0:5.8-2.el6 will be installed
---> Package diffstat.i686 0:1.51-2.el6 will be installed
---> Package doxygen.i686 1:1.6.1-6.el6 will be installed
---> Package flex.i686 0:2.5.35-8.el6 will be installed
---> Package gcc.i686 0:4.4.6-3.el6 will be installed
--> Processing Dependency: libgomp = 4.4.6-3.el6 for package: gcc-4.4.6-3.el6.i686
--> Processing Dependency: cpp = 4.4.6-3.el6 for package: gcc-4.4.6-3.el6.i686
--> Processing Dependency: glibc-devel >= 2.2.90-12 for package: gcc-4.4.6-3.el6.i686
--> Processing Dependency: cloog-ppl >= 0.15 for package: gcc-4.4.6-3.el6.i686
---> Package gcc-c++.i686 0:4.4.6-3.el6 will be installed
--> Processing Dependency: libstdc++-devel = 4.4.6-3.el6 for package: gcc-c++-4.4.6-3.el6.i686
--> Processing Dependency: libstdc++ = 4.4.6-3.el6 for package: gcc-c++-4.4.6-3.el6.i686
--> Processing Dependency: libmpfr.so.1 for package: gcc-c++-4.4.6-3.el6.i686
---> Package gcc-gfortran.i686 0:4.4.6-3.el6 will be installed
--> Processing Dependency: libgfortran = 4.4.6-3.el6 for package: gcc-gfortran-4.4.6-3.el6.i686
---> Package git.i686 0:1.7.1-2.el6_0.1 will be installed
--> Processing Dependency: perl-Git = 1.7.1-2.el6_0.1 for package: git-1.7.1-2.el6_0.1.i686
--> Processing Dependency: perl(Git) for package: git-1.7.1-2.el6_0.1.i686
--> Processing Dependency: perl(Error) for package: git-1.7.1-2.el6_0.1.i686
---> Package indent.i686 0:2.2.10-5.1.el6 will be installed
---> Package intltool.noarch 0:0.41.0-1.1.el6 will be installed
--> Processing Dependency: gettext-devel for package: intltool-0.41.0-1.1.el6.noarch
---> Package libtool.i686 0:2.2.6-15.5.el6 will be installed
---> Package patchutils.i686 0:0.3.1-3.1.el6 will be installed
---> Package rcs.i686 0:5.7-37.el6 will be installed
---> Package redhat-rpm-config.noarch 0:9.0.3-34.el6 will be installed
---> Package rpm-build.i686 0:4.8.0-19.el6_2.1 will be installed
--> Processing Dependency: rpm = 4.8.0-19.el6_2.1 for package: rpm-build-4.8.0-19.el6_2.1.i686
---> Package subversion.i686 0:1.6.11-2.el6_1.4 will be installed
--> Processing Dependency: apr >= 1.3.0 for package: subversion-1.6.11-2.el6_1.4.i686
--> Processing Dependency: libneon.so.27 for package: subversion-1.6.11-2.el6_1.4.i686
--> Processing Dependency: libaprutil-1.so.0 for package: subversion-1.6.11-2.el6_1.4.i686
--> Processing Dependency: libapr-1.so.0 for package: subversion-1.6.11-2.el6_1.4.i686
---> Package swig.i686 0:1.3.40-6.el6 will be installed
---> Package systemtap.i686 0:1.6-5.el6_2 will be installed
--> Processing Dependency: systemtap-runtime = 1.6-5.el6_2 for package: systemtap-1.6-5.el6_2.i686
--> Processing Dependency: kernel-devel for package: systemtap-1.6-5.el6_2.i686
--> Running transaction check
---> Package apr.i686 0:1.3.9-5.el6_2 will be installed
---> Package apr-util.i686 0:1.3.9-3.el6_0.1 will be installed
---> Package cloog-ppl.i686 0:0.15.7-1.2.el6 will be installed
--> Processing Dependency: libppl_c.so.2 for package: cloog-ppl-0.15.7-1.2.el6.i686
--> Processing Dependency: libppl.so.7 for package: cloog-ppl-0.15.7-1.2.el6.i686
---> Package cpp.i686 0:4.4.6-3.el6 will be installed
---> Package gcc.i686 0:4.4.6-3.el6 will be installed
--> Processing Dependency: libgomp = 4.4.6-3.el6 for package: gcc-4.4.6-3.el6.i686
---> Package gcc-c++.i686 0:4.4.6-3.el6 will be installed
--> Processing Dependency: libstdc++ = 4.4.6-3.el6 for package: gcc-c++-4.4.6-3.el6.i686
---> Package gcc-gfortran.i686 0:4.4.6-3.el6 will be installed
--> Processing Dependency: libgfortran = 4.4.6-3.el6 for package: gcc-gfortran-4.4.6-3.el6.i686
---> Package gettext-devel.i686 0:0.17-16.el6 will be installed
--> Processing Dependency: gettext-libs = 0.17-16.el6 for package: gettext-devel-0.17-16.el6.i686
--> Processing Dependency: libgettextpo.so.0 for package: gettext-devel-0.17-16.el6.i686
--> Processing Dependency: libgcj_bc.so.1 for package: gettext-devel-0.17-16.el6.i686
--> Processing Dependency: libasprintf.so.0 for package: gettext-devel-0.17-16.el6.i686
---> Package glibc-devel.i686 0:2.12-1.47.el6_2.12 will be installed
--> Processing Dependency: glibc-headers = 2.12-1.47.el6_2.12 for package: glibc-devel-2.12-1.47.el6_2.12.i686
--> Processing Dependency: glibc = 2.12-1.47.el6_2.12 for package: glibc-devel-2.12-1.47.el6_2.12.i686
--> Processing Dependency: glibc-headers for package: glibc-devel-2.12-1.47.el6_2.12.i686
---> Package kernel-devel.i686 0:2.6.32-220.17.1.el6 will be installed
---> Package libstdc++-devel.i686 0:4.4.6-3.el6 will be installed
--> Processing Dependency: libstdc++(x86-32) = 4.4.6-3.el6 for package: libstdc++-devel-4.4.6-3.el6.i686
---> Package mpfr.i686 0:2.4.1-6.el6 will be installed
---> Package neon.i686 0:0.29.3-1.2.el6 will be installed
--> Processing Dependency: libproxy.so.0 for package: neon-0.29.3-1.2.el6.i686
--> Processing Dependency: libpakchois.so.0 for package: neon-0.29.3-1.2.el6.i686
---> Package perl-Error.noarch 1:0.17015-4.el6 will be installed
---> Package perl-Git.noarch 0:1.7.1-2.el6_0.1 will be installed
---> Package rpm-build.i686 0:4.8.0-19.el6_2.1 will be installed
--> Processing Dependency: rpm = 4.8.0-19.el6_2.1 for package: rpm-build-4.8.0-19.el6_2.1.i686
---> Package systemtap.i686 0:1.6-5.el6_2 will be installed
--> Processing Dependency: systemtap-runtime = 1.6-5.el6_2 for package: systemtap-1.6-5.el6_2.i686
--> Running transaction check
---> Package gcc.i686 0:4.4.6-3.el6 will be installed
--> Processing Dependency: libgomp = 4.4.6-3.el6 for package: gcc-4.4.6-3.el6.i686
---> Package gcc-c++.i686 0:4.4.6-3.el6 will be installed
--> Processing Dependency: libstdc++ = 4.4.6-3.el6 for package: gcc-c++-4.4.6-3.el6.i686
---> Package gcc-gfortran.i686 0:4.4.6-3.el6 will be installed
--> Processing Dependency: libgfortran = 4.4.6-3.el6 for package: gcc-gfortran-4.4.6-3.el6.i686
---> Package gettext-libs.i686 0:0.17-16.el6 will be installed
---> Package glibc-devel.i686 0:2.12-1.47.el6_2.12 will be installed
--> Processing Dependency: glibc = 2.12-1.47.el6_2.12 for package: glibc-devel-2.12-1.47.el6_2.12.i686
---> Package glibc-headers.i686 0:2.12-1.47.el6_2.12 will be installed
--> Processing Dependency: glibc = 2.12-1.47.el6_2.12 for package: glibc-headers-2.12-1.47.el6_2.12.i686
--> Processing Dependency: kernel-headers >= 2.2.1 for package: glibc-headers-2.12-1.47.el6_2.12.i686
--> Processing Dependency: kernel-headers for package: glibc-headers-2.12-1.47.el6_2.12.i686
---> Package libgcj.i686 0:4.4.6-3.el6 will be installed
--> Processing Dependency: libart_lgpl >= 2.1.0 for package: libgcj-4.4.6-3.el6.i686
---> Package libproxy.i686 0:0.3.0-2.el6 will be installed
--> Processing Dependency: libproxy-python = 0.3.0-2.el6 for package: libproxy-0.3.0-2.el6.i686
--> Processing Dependency: libproxy-bin = 0.3.0-2.el6 for package: libproxy-0.3.0-2.el6.i686
---> Package libstdc++-devel.i686 0:4.4.6-3.el6 will be installed
--> Processing Dependency: libstdc++(x86-32) = 4.4.6-3.el6 for package: libstdc++-devel-4.4.6-3.el6.i686
---> Package pakchois.i686 0:0.4-3.2.el6 will be installed
---> Package ppl.i686 0:0.10.2-11.el6 will be installed
---> Package rpm-build.i686 0:4.8.0-19.el6_2.1 will be installed
--> Processing Dependency: rpm = 4.8.0-19.el6_2.1 for package: rpm-build-4.8.0-19.el6_2.1.i686
---> Package systemtap.i686 0:1.6-5.el6_2 will be installed
--> Processing Dependency: systemtap-runtime = 1.6-5.el6_2 for package: systemtap-1.6-5.el6_2.i686
--> Running transaction check
---> Package gcc.i686 0:4.4.6-3.el6 will be installed
--> Processing Dependency: libgomp = 4.4.6-3.el6 for package: gcc-4.4.6-3.el6.i686
---> Package gcc-c++.i686 0:4.4.6-3.el6 will be installed
--> Processing Dependency: libstdc++ = 4.4.6-3.el6 for package: gcc-c++-4.4.6-3.el6.i686
---> Package gcc-gfortran.i686 0:4.4.6-3.el6 will be installed
--> Processing Dependency: libgfortran = 4.4.6-3.el6 for package: gcc-gfortran-4.4.6-3.el6.i686
---> Package glibc-devel.i686 0:2.12-1.47.el6_2.12 will be installed
--> Processing Dependency: glibc = 2.12-1.47.el6_2.12 for package: glibc-devel-2.12-1.47.el6_2.12.i686
---> Package glibc-headers.i686 0:2.12-1.47.el6_2.12 will be installed
--> Processing Dependency: glibc = 2.12-1.47.el6_2.12 for package: glibc-headers-2.12-1.47.el6_2.12.i686
---> Package kernel-headers.i686 0:2.6.32-220.17.1.el6 will be installed
---> Package libart_lgpl.i686 0:2.3.20-5.1.el6 will be installed
---> Package libproxy-bin.i686 0:0.3.0-2.el6 will be installed
---> Package libproxy-python.i686 0:0.3.0-2.el6 will be installed
---> Package libstdc++-devel.i686 0:4.4.6-3.el6 will be installed
--> Processing Dependency: libstdc++(x86-32) = 4.4.6-3.el6 for package: libstdc++-devel-4.4.6-3.el6.i686
---> Package rpm-build.i686 0:4.8.0-19.el6_2.1 will be installed
--> Processing Dependency: rpm = 4.8.0-19.el6_2.1 for package: rpm-build-4.8.0-19.el6_2.1.i686
---> Package systemtap.i686 0:1.6-5.el6_2 will be installed
--> Processing Dependency: systemtap-runtime = 1.6-5.el6_2 for package: systemtap-1.6-5.el6_2.i686
--> Finished Dependency Resolution
 You could try using --skip-broken to work around the problem
 You could try running: rpm -Va --nofiles --nodigest 
EXPECTED RESULT: 
RETURN CODE: 1
FAIL1
Loaded plugins: amazon-id, product-id, rhui-lb, security, subscription-manager Updating certificate-based repositories. Setting up Group Process Package matching 1:make-3.81-19.el6.i686 already installed. Checking for update. Package 1:pkgconfig-0.23-9.1.el6.i686 already installed and latest version Package gettext-0.17-16.el6.i686 already installed and latest version Package patch-2.6-6.el6.i686 already installed and latest version Package matching binutils-2.20.51.0.2-5.28.el6.i686 already installed. Checking for update. Package elfutils-0.152-1.el6.i686 already installed and latest version Package cvs-1.11.23-11.el6_2.1.i686 already installed and latest version Resolving Dependencies --> Running transaction check ---> Package autoconf.noarch 0:2.63-5.1.el6 will be installed ---> Package automake.noarch 0:1.11.1-1.2.el6 will be installed ---> Package bison.i686 0:2.4.1-5.el6 will be installed ---> Package byacc.i686 0:1.9.20070509-6.1.el6 will be installed ---> Package cscope.i686 0:15.6-6.el6 will be installed ---> Package ctags.i686 0:5.8-2.el6 will be installed ---> Package diffstat.i686 0:1.51-2.el6 will be installed ---> Package doxygen.i686 1:1.6.1-6.el6 will be installed ---> Package flex.i686 0:2.5.35-8.el6 will be installed ---> Package gcc.i686 0:4.4.6-3.el6 will be installed --> Processing Dependency: libgomp = 4.4.6-3.el6 for package: gcc-4.4.6-3.el6.i686 --> Processing Dependency: cpp = 4.4.6-3.el6 for package: gcc-4.4.6-3.el6.i686 --> Processing Dependency: glibc-devel >= 2.2.90-12 for package: gcc-4.4.6-3.el6.i686 --> Processing Dependency: cloog-ppl >= 0.15 for package: gcc-4.4.6-3.el6.i686 ---> Package gcc-c++.i686 0:4.4.6-3.el6 will be installed --> Processing Dependency: libstdc++-devel = 4.4.6-3.el6 for package: gcc-c++-4.4.6-3.el6.i686 --> Processing Dependency: libstdc++ = 4.4.6-3.el6 for package: gcc-c++-4.4.6-3.el6.i686 --> Processing Dependency: libmpfr.so.1 for package: gcc-c++-4.4.6-3.el6.i686 ---> Package gcc-gfortran.i686 0:4.4.6-3.el6 will be installed --> Processing Dependency: libgfortran = 4.4.6-3.el6 for package: gcc-gfortran-4.4.6-3.el6.i686 ---> Package git.i686 0:1.7.1-2.el6_0.1 will be installed --> Processing Dependency: perl-Git = 1.7.1-2.el6_0.1 for package: git-1.7.1-2.el6_0.1.i686 --> Processing Dependency: perl(Git) for package: git-1.7.1-2.el6_0.1.i686 --> Processing Dependency: perl(Error) for package: git-1.7.1-2.el6_0.1.i686 ---> Package indent.i686 0:2.2.10-5.1.el6 will be installed ---> Package intltool.noarch 0:0.41.0-1.1.el6 will be installed --> Processing Dependency: gettext-devel for package: intltool-0.41.0-1.1.el6.noarch ---> Package libtool.i686 0:2.2.6-15.5.el6 will be installed ---> Package patchutils.i686 0:0.3.1-3.1.el6 will be installed ---> Package rcs.i686 0:5.7-37.el6 will be installed ---> Package redhat-rpm-config.noarch 0:9.0.3-34.el6 will be installed ---> Package rpm-build.i686 0:4.8.0-19.el6_2.1 will be installed --> Processing Dependency: rpm = 4.8.0-19.el6_2.1 for package: rpm-build-4.8.0-19.el6_2.1.i686 ---> Package subversion.i686 0:1.6.11-2.el6_1.4 will be installed --> Processing Dependency: apr >= 1.3.0 for package: subversion-1.6.11-2.el6_1.4.i686 --> Processing Dependency: libneon.so.27 for package: subversion-1.6.11-2.el6_1.4.i686 --> Processing Dependency: libaprutil-1.so.0 for package: subversion-1.6.11-2.el6_1.4.i686 --> Processing Dependency: libapr-1.so.0 for package: subversion-1.6.11-2.el6_1.4.i686 ---> Package swig.i686 0:1.3.40-6.el6 will be installed ---> Package systemtap.i686 0:1.6-5.el6_2 will be installed --> Processing Dependency: systemtap-runtime = 1.6-5.el6_2 for package: systemtap-1.6-5.el6_2.i686 --> Processing Dependency: kernel-devel for package: systemtap-1.6-5.el6_2.i686 --> Running transaction check ---> Package apr.i686 0:1.3.9-5.el6_2 will be installed ---> Package apr-util.i686 0:1.3.9-3.el6_0.1 will be installed ---> Package cloog-ppl.i686 0:0.15.7-1.2.el6 will be installed --> Processing Dependency: libppl_c.so.2 for package: cloog-ppl-0.15.7-1.2.el6.i686 --> Processing Dependency: libppl.so.7 for package: cloog-ppl-0.15.7-1.2.el6.i686 ---> Package cpp.i686 0:4.4.6-3.el6 will be installed ---> Package gcc.i686 0:4.4.6-3.el6 will be installed --> Processing Dependency: libgomp = 4.4.6-3.el6 for package: gcc-4.4.6-3.el6.i686 ---> Package gcc-c++.i686 0:4.4.6-3.el6 will be installed --> Processing Dependency: libstdc++ = 4.4.6-3.el6 for package: gcc-c++-4.4.6-3.el6.i686 ---> Package gcc-gfortran.i686 0:4.4.6-3.el6 will be installed --> Processing Dependency: libgfortran = 4.4.6-3.el6 for package: gcc-gfortran-4.4.6-3.el6.i686 ---> Package gettext-devel.i686 0:0.17-16.el6 will be installed --> Processing Dependency: gettext-libs = 0.17-16.el6 for package: gettext-devel-0.17-16.el6.i686 --> Processing Dependency: libgettextpo.so.0 for package: gettext-devel-0.17-16.el6.i686 --> Processing Dependency: libgcj_bc.so.1 for package: gettext-devel-0.17-16.el6.i686 --> Processing Dependency: libasprintf.so.0 for package: gettext-devel-0.17-16.el6.i686 ---> Package glibc-devel.i686 0:2.12-1.47.el6_2.12 will be installed --> Processing Dependency: glibc-headers = 2.12-1.47.el6_2.12 for package: glibc-devel-2.12-1.47.el6_2.12.i686 --> Processing Dependency: glibc = 2.12-1.47.el6_2.12 for package: glibc-devel-2.12-1.47.el6_2.12.i686 --> Processing Dependency: glibc-headers for package: glibc-devel-2.12-1.47.el6_2.12.i686 ---> Package kernel-devel.i686 0:2.6.32-220.17.1.el6 will be installed ---> Package libstdc++-devel.i686 0:4.4.6-3.el6 will be installed --> Processing Dependency: libstdc++(x86-32) = 4.4.6-3.el6 for package: libstdc++-devel-4.4.6-3.el6.i686 ---> Package mpfr.i686 0:2.4.1-6.el6 will be installed ---> Package neon.i686 0:0.29.3-1.2.el6 will be installed --> Processing Dependency: libproxy.so.0 for package: neon-0.29.3-1.2.el6.i686 --> Processing Dependency: libpakchois.so.0 for package: neon-0.29.3-1.2.el6.i686 ---> Package perl-Error.noarch 1:0.17015-4.el6 will be installed ---> Package perl-Git.noarch 0:1.7.1-2.el6_0.1 will be installed ---> Package rpm-build.i686 0:4.8.0-19.el6_2.1 will be installed --> Processing Dependency: rpm = 4.8.0-19.el6_2.1 for package: rpm-build-4.8.0-19.el6_2.1.i686 ---> Package systemtap.i686 0:1.6-5.el6_2 will be installed --> Processing Dependency: systemtap-runtime = 1.6-5.el6_2 for package: systemtap-1.6-5.el6_2.i686 --> Running transaction check ---> Package gcc.i686 0:4.4.6-3.el6 will be installed --> Processing Dependency: libgomp = 4.4.6-3.el6 for package: gcc-4.4.6-3.el6.i686 ---> Package gcc-c++.i686 0:4.4.6-3.el6 will be installed --> Processing Dependency: libstdc++ = 4.4.6-3.el6 for package: gcc-c++-4.4.6-3.el6.i686 ---> Package gcc-gfortran.i686 0:4.4.6-3.el6 will be installed --> Processing Dependency: libgfortran = 4.4.6-3.el6 for package: gcc-gfortran-4.4.6-3.el6.i686 ---> Package gettext-libs.i686 0:0.17-16.el6 will be installed ---> Package glibc-devel.i686 0:2.12-1.47.el6_2.12 will be installed --> Processing Dependency: glibc = 2.12-1.47.el6_2.12 for package: glibc-devel-2.12-1.47.el6_2.12.i686 ---> Package glibc-headers.i686 0:2.12-1.47.el6_2.12 will be installed --> Processing Dependency: glibc = 2.12-1.47.el6_2.12 for package: glibc-headers-2.12-1.47.el6_2.12.i686 --> Processing Dependency: kernel-headers >= 2.2.1 for package: glibc-headers-2.12-1.47.el6_2.12.i686 --> Processing Dependency: kernel-headers for package: glibc-headers-2.12-1.47.el6_2.12.i686 ---> Package libgcj.i686 0:4.4.6-3.el6 will be installed --> Processing Dependency: libart_lgpl >= 2.1.0 for package: libgcj-4.4.6-3.el6.i686 ---> Package libproxy.i686 0:0.3.0-2.el6 will be installed --> Processing Dependency: libproxy-python = 0.3.0-2.el6 for package: libproxy-0.3.0-2.el6.i686 --> Processing Dependency: libproxy-bin = 0.3.0-2.el6 for package: libproxy-0.3.0-2.el6.i686 ---> Package libstdc++-devel.i686 0:4.4.6-3.el6 will be installed --> Processing Dependency: libstdc++(x86-32) = 4.4.6-3.el6 for package: libstdc++-devel-4.4.6-3.el6.i686 ---> Package pakchois.i686 0:0.4-3.2.el6 will be installed ---> Package ppl.i686 0:0.10.2-11.el6 will be installed ---> Package rpm-build.i686 0:4.8.0-19.el6_2.1 will be installed --> Processing Dependency: rpm = 4.8.0-19.el6_2.1 for package: rpm-build-4.8.0-19.el6_2.1.i686 ---> Package systemtap.i686 0:1.6-5.el6_2 will be installed --> Processing Dependency: systemtap-runtime = 1.6-5.el6_2 for package: systemtap-1.6-5.el6_2.i686 --> Running transaction check ---> Package gcc.i686 0:4.4.6-3.el6 will be installed --> Processing Dependency: libgomp = 4.4.6-3.el6 for package: gcc-4.4.6-3.el6.i686 ---> Package gcc-c++.i686 0:4.4.6-3.el6 will be installed --> Processing Dependency: libstdc++ = 4.4.6-3.el6 for package: gcc-c++-4.4.6-3.el6.i686 ---> Package gcc-gfortran.i686 0:4.4.6-3.el6 will be installed --> Processing Dependency: libgfortran = 4.4.6-3.el6 for package: gcc-gfortran-4.4.6-3.el6.i686 ---> Package glibc-devel.i686 0:2.12-1.47.el6_2.12 will be installed --> Processing Dependency: glibc = 2.12-1.47.el6_2.12 for package: glibc-devel-2.12-1.47.el6_2.12.i686 ---> Package glibc-headers.i686 0:2.12-1.47.el6_2.12 will be installed --> Processing Dependency: glibc = 2.12-1.47.el6_2.12 for package: glibc-headers-2.12-1.47.el6_2.12.i686 ---> Package kernel-headers.i686 0:2.6.32-220.17.1.el6 will be installed ---> Package libart_lgpl.i686 0:2.3.20-5.1.el6 will be installed ---> Package libproxy-bin.i686 0:0.3.0-2.el6 will be installed ---> Package libproxy-python.i686 0:0.3.0-2.el6 will be installed ---> Package libstdc++-devel.i686 0:4.4.6-3.el6 will be installed --> Processing Dependency: libstdc++(x86-32) = 4.4.6-3.el6 for package: libstdc++-devel-4.4.6-3.el6.i686 ---> Package rpm-build.i686 0:4.8.0-19.el6_2.1 will be installed --> Processing Dependency: rpm = 4.8.0-19.el6_2.1 for package: rpm-build-4.8.0-19.el6_2.1.i686 ---> Package systemtap.i686 0:1.6-5.el6_2 will be installed --> Processing Dependency: systemtap-runtime = 1.6-5.el6_2 for package: systemtap-1.6-5.el6_2.i686 --> Finished Dependency Resolution You could try using --skip-broken to work around the problem You could try running: rpm -Va --nofiles --nodigest
# checking possible sys update
Loaded plugins: amazon-id, product-id, rhui-lb, security, subscription-manager
Updating certificate-based repositories.
# no sys update found
######################################################################################
# NEW TEST: ## Verify yum update ... 
######################################################################################
COMMAND:  /usr/bin/yum -y update
Unable to read consumer identity
RESULT: Loaded plugins: amazon-id, product-id, rhui-lb, security, subscription-manager
Updating certificate-based repositories.
Setting up Update Process
Resolving Dependencies
--> Running transaction check
---> Package dmidecode.i686 1:2.11-2.el6 will be updated
---> Package dmidecode.i686 1:2.11-2.el6_1 will be an update
---> Package java-1.6.0-openjdk.i686 1:1.6.0.0-1.45.1.11.1.el6 will be updated
---> Package java-1.6.0-openjdk.i686 1:1.6.0.0-1.48.1.11.3.el6_2 will be an update
---> Package perl-Compress-Raw-Bzip2.i686 0:2.020-127.el6 will be updated
---> Package perl-Compress-Raw-Bzip2.i686 0:2.027-1.el6 will be an update
--> Finished Dependency Resolution

Dependencies Resolved

================================================================================
 Package    Arch Version         Repository                                Size
================================================================================
Updating:
 dmidecode  i686 1:2.11-2.el6_1  rhui-ap-southeast-1-rhel-server-releases  70 k
 java-1.6.0-openjdk
            i686 1:1.6.0.0-1.48.1.11.3.el6_2
                                 rhui-ap-southeast-1-rhel-server-releases  26 M
 perl-Compress-Raw-Bzip2
            i686 2.027-1.el6     epel                                      30 k

Transaction Summary
================================================================================
Upgrade       3 Package(s)

Total download size: 26 M
Downloading Packages:
--------------------------------------------------------------------------------
Total                                            16 MB/s |  26 MB     00:01     
Running rpm_check_debug
Running Transaction Test
Transaction Test Succeeded
Running Transaction

  Updating   : perl-Compress-Raw-Bzip2-2.027-1.el6.i686                     1/6 

  Updating   : 1:dmidecode-2.11-2.el6_1.i686                                2/6 

  Updating   : 1:java-1.6.0-openjdk-1.6.0.0-1.48.1.11.3.el6_2.i686          3/6 

  Cleanup    : 1:dmidecode-2.11-2.el6.i686                                  4/6 

  Cleanup    : perl-Compress-Raw-Bzip2-2.020-127.el6.i686                   5/6 

  Cleanup    : 1:java-1.6.0-openjdk-1.6.0.0-1.45.1.11.1.el6.i686            6/6 
Installed products updated.

  Verifying  : 1:java-1.6.0-openjdk-1.6.0.0-1.48.1.11.3.el6_2.i686          1/6 

  Verifying  : perl-Compress-Raw-Bzip2-2.027-1.el6.i686                     2/6 

  Verifying  : 1:dmidecode-2.11-2.el6_1.i686                                3/6 

  Verifying  : 1:dmidecode-2.11-2.el6.i686                                  4/6 

  Verifying  : 1:java-1.6.0-openjdk-1.6.0.0-1.45.1.11.1.el6.i686            5/6 

  Verifying  : perl-Compress-Raw-Bzip2-2.020-127.el6.i686                   6/6 

Updated:
  dmidecode.i686 1:2.11-2.el6_1                                                 
  java-1.6.0-openjdk.i686 1:1.6.0.0-1.48.1.11.3.el6_2                           
  perl-Compress-Raw-Bzip2.i686 0:2.027-1.el6                                    

Complete! 
EXPECTED RESULT: 
RETURN CODE: 0
PASS
######################################################################################
# NEW TEST: ## Verify no fa1lures in rpm package ... 
######################################################################################
COMMAND:  cat /root/valid/src/validate.log | grep 'failure in rpm package' | wc -l
RESULT: 1 
EXPECTED RESULT: 1
RETURN CODE: 0
PASS
######################################################################################
# NEW TEST: ## Verify no rpm scriplet fa1lures ... 
######################################################################################
COMMAND:  cat /root/valid/src/validate.log | grep 'scriptlet failed, exit status 1' | wc -l
RESULT: 1 
EXPECTED RESULT: 1
RETURN CODE: 0
PASS
######################################################################################
# NEW TEST: ## Verify package removal... 
######################################################################################
COMMAND: /bin/rpm -e zsh
RETURN CODE: 0
COMMAND:  /bin/rpm -q zsh
RESULT: package zsh is not installed 
EXPECTED RESULT: package zsh is not installed
RETURN CODE: 1
PASS
######################################################################################
# NEW TEST: ## install zsh ... 
######################################################################################
COMMAND: /usr/bin/yum -y install zsh
Unable to read consumer identity
Warning: RPMDB altered outside of yum.
RETURN CODE: 0
COMMAND:  /bin/rpm -q --queryformat '%{NAME}\n' zsh
RESULT: zsh 
EXPECTED RESULT: zsh
RETURN CODE: 0
PASS
######################################################################################
# NEW TEST: ## Verify package removal ... 
######################################################################################
COMMAND: /bin/rpm -e zsh
RETURN CODE: 0
COMMAND:  /bin/rpm -q zsh
RESULT: package zsh is not installed 
EXPECTED RESULT: package zsh is not installed
RETURN CODE: 1
PASS
# checking possible sys update
Loaded plugins: amazon-id, product-id, rhui-lb, security, subscription-manager
Updating certificate-based repositories.
# no sys update found
######################################################################################
# NEW TEST: ## Verify yum update ... 
######################################################################################
COMMAND:  /usr/bin/yum -y update
Unable to read consumer identity
RESULT: Loaded plugins: amazon-id, product-id, rhui-lb, security, subscription-manager
Updating certificate-based repositories.
Setting up Update Process
No Packages marked for Update 
EXPECTED RESULT: 
RETURN CODE: 0
PASS
######################################################################################
# NEW TEST: ## Verify disabled yum plugin ... 
######################################################################################
COMMAND:  grep ^enabled /etc/yum/pluginconf.d/rhnplugin.conf | grep -v '^#' | cut -d\= -f2 | awk '{print }' | sort -f | uniq
RESULT:  0 
EXPECTED RESULT: 
RETURN CODE: 0
PASS

## Summary ##
FAILURES = 1
FAILED TESTS = ## Install Development tools group...
LOG FILE = /root/valid/src/validate.log
## Summary ##

######################################################################################
# NEW TEST: ## Open a bugzilla
######################################################################################
Comment 11 mkovacik 2012-06-18 04:20:56 EDT
IMAGE ID= ami-28d6907a_ap-southeast-1_m1.small
###### TEST KERNEL AFTER REBOOT ####  
######################################################################################
# NEW TEST: ## Verify disabled yum plugin ... 
######################################################################################
COMMAND:  grep ^enabled /etc/yum/pluginconf.d/rhnplugin.conf | grep -v '^#' | cut -d\= -f2 | awk '{print }' | sort -f | uniq
RESULT:  0 
EXPECTED RESULT: 
RETURN CODE: 0
PASS
######################################################################################
# NEW TEST: ## Verify kernel name ... 
######################################################################################
COMMAND:  /bin/uname -s
RESULT: Linux 
EXPECTED RESULT: Linux
RETURN CODE: 0
PASS
######################################################################################
# NEW TEST: ## Verify latest installed kernel is running ... 
######################################################################################
Detected rpm kernel version: 2.6.32-276.el6.i686
Detected uname kernel version: 2.6.32-276.el6.i686
COMMAND:  true
RESULT:  
EXPECTED RESULT: 
RETURN CODE: 0
PASS
######################################################################################
# NEW TEST: ## Verify latest kenerl is in /boot/grub/menu.1st ... 
######################################################################################
COMMAND:  cat /boot/grub/menu.lst | grep 2.6.32-276.el6.i686
RESULT: title RHEL6.3-20120531.0-Server-i386-starter-ec2 (2.6.32-276.el6.i686)
        kernel /boot/vmlinuz-2.6.32-276.el6.i686 ro root=LABEL=_/ 
        initrd /boot/initramfs-2.6.32-276.el6.i686.img 
EXPECTED RESULT: 
RETURN CODE: 0
PASS
######################################################################################
# NEW TEST: ## Verify operating system ... 
######################################################################################
COMMAND:  /bin/uname -o
RESULT: GNU/Linux 
EXPECTED RESULT: GNU/Linux
RETURN CODE: 0
PASS
######################################################################################
# NEW TEST: ## Verify /etc/sysconfig/kernel ... 
######################################################################################
COMMAND:  ls /etc/sysconfig/kernel
RESULT: /etc/sysconfig/kernel 
EXPECTED RESULT: 
RETURN CODE: 0
PASS
######################################################################################
# NEW TEST: ## Verify /etc/sysconfig/kernel contains UPDATEDEFAULT ... 
######################################################################################
COMMAND:  cat /etc/sysconfig/kernel | grep UPDATEDEFAULT=yes
RESULT: UPDATEDEFAULT=yes 
EXPECTED RESULT: 
RETURN CODE: 0
PASS
######################################################################################
# NEW TEST: ## Verify /etc/sysconfig/kernel contains DEFAULTKERNEL ... 
######################################################################################
COMMAND:  cat /etc/sysconfig/kernel | grep DEFAULTKERNEL=kernel
RESULT: DEFAULTKERNEL=kernel 
EXPECTED RESULT: 
RETURN CODE: 0
PASS
######################################################################################
# NEW TEST: ## Verify system up to date
######################################################################################
COMMAND:  _check_sys_update_phase1
# no update was required
RESULT: # checking sys update done
# no update was required 
EXPECTED RESULT: 
RETURN CODE: 0
PASS
######################################################################################
# NEW TEST: ##Verify memory match hwp ... 
######################################################################################
cat /proc/meminfo | grep MemTotal: | awk '{print }'
FOUND MEMORY OF 1711852 > hwp MEMORY of 1700000
COMMAND:  echo true
RESULT: true 
EXPECTED RESULT: 
RETURN CODE: 0
PASS
hostname
######################################################################################
# NEW TEST: The selected image has the version RHEL 6.3
######################################################################################

## Summary ##
FAILURES = 1
FAILED TESTS = ## Install Development tools group...
LOG FILE = /root/valid/src/validate.log
## Summary ##

######################################################################################
# NEW TEST: ## Open a bugzilla
######################################################################################
Comment 12 mkovacik 2012-06-18 04:21:03 EDT
IMAGE ID= ami-28d6907a_ap-southeast-1_t1.micro
###### TEST KERNEL AFTER REBOOT ####  
######################################################################################
# NEW TEST: ## Verify disabled yum plugin ... 
######################################################################################
COMMAND:  grep ^enabled /etc/yum/pluginconf.d/rhnplugin.conf | grep -v '^#' | cut -d\= -f2 | awk '{print }' | sort -f | uniq
RESULT:  0 
EXPECTED RESULT: 
RETURN CODE: 0
PASS
######################################################################################
# NEW TEST: ## Verify kernel name ... 
######################################################################################
COMMAND:  /bin/uname -s
RESULT: Linux 
EXPECTED RESULT: Linux
RETURN CODE: 0
PASS
######################################################################################
# NEW TEST: ## Verify latest installed kernel is running ... 
######################################################################################
Detected rpm kernel version: 2.6.32-276.el6.i686
Detected uname kernel version: 2.6.32-276.el6.i686
COMMAND:  true
RESULT:  
EXPECTED RESULT: 
RETURN CODE: 0
PASS
######################################################################################
# NEW TEST: ## Verify latest kenerl is in /boot/grub/menu.1st ... 
######################################################################################
COMMAND:  cat /boot/grub/menu.lst | grep 2.6.32-276.el6.i686
RESULT: title RHEL6.3-20120531.0-Server-i386-starter-ec2 (2.6.32-276.el6.i686)
        kernel /boot/vmlinuz-2.6.32-276.el6.i686 ro root=LABEL=_/ 
        initrd /boot/initramfs-2.6.32-276.el6.i686.img 
EXPECTED RESULT: 
RETURN CODE: 0
PASS
######################################################################################
# NEW TEST: ## Verify operating system ... 
######################################################################################
COMMAND:  /bin/uname -o
RESULT: GNU/Linux 
EXPECTED RESULT: GNU/Linux
RETURN CODE: 0
PASS
######################################################################################
# NEW TEST: ## Verify /etc/sysconfig/kernel ... 
######################################################################################
COMMAND:  ls /etc/sysconfig/kernel
RESULT: /etc/sysconfig/kernel 
EXPECTED RESULT: 
RETURN CODE: 0
PASS
######################################################################################
# NEW TEST: ## Verify /etc/sysconfig/kernel contains UPDATEDEFAULT ... 
######################################################################################
COMMAND:  cat /etc/sysconfig/kernel | grep UPDATEDEFAULT=yes
RESULT: UPDATEDEFAULT=yes 
EXPECTED RESULT: 
RETURN CODE: 0
PASS
######################################################################################
# NEW TEST: ## Verify /etc/sysconfig/kernel contains DEFAULTKERNEL ... 
######################################################################################
COMMAND:  cat /etc/sysconfig/kernel | grep DEFAULTKERNEL=kernel
RESULT: DEFAULTKERNEL=kernel 
EXPECTED RESULT: 
RETURN CODE: 0
PASS
######################################################################################
# NEW TEST: ## Verify system up to date
######################################################################################
COMMAND:  _check_sys_update_phase1
# no update was required
RESULT: # checking sys update done
# no update was required 
EXPECTED RESULT: 
RETURN CODE: 0
PASS
######################################################################################
# NEW TEST: ##Verify memory match hwp ... 
######################################################################################
cat /proc/meminfo | grep MemTotal: | awk '{print }'
FOUND MEMORY OF 610340 > hwp MEMORY of 600000
COMMAND:  echo true
RESULT: true 
EXPECTED RESULT: 
RETURN CODE: 0
PASS
hostname
######################################################################################
# NEW TEST: The selected image has the version RHEL 6.3
######################################################################################

## Summary ##
FAILURES = 1
FAILED TESTS = ## Install Development tools group...
LOG FILE = /root/valid/src/validate.log
## Summary ##

######################################################################################
# NEW TEST: ## Open a bugzilla
######################################################################################
Comment 13 mkovacik 2012-06-18 04:29:36 EDT
Install Development tools group is OK to fail atm
Comment 14 mkovacik 2012-06-18 05:01:48 EDT
Closing verified validation bugs.

Note You need to log in before you can comment on or make changes to this bug.