Bug 862342 - [ Procedure 9.1. Build CarMart to JBoss Application Server ] Procedure does not work.
[ Procedure 9.1. Build CarMart to JBoss Application Server ] Procedure does n...
Status: CLOSED NOTABUG
Product: JBoss Data Grid 6
Classification: JBoss
Component: Documentation (Show other bugs)
unspecified
Unspecified Unspecified
unspecified Severity unspecified
: ---
: ---
Assigned To: Misha H. Ali
:
Depends On:
Blocks:
  Show dependency treegraph
 
Reported: 2012-10-02 13:03 EDT by Frederic Hornain
Modified: 2012-10-02 13:27 EDT (History)
1 user (show)

See Also:
Fixed In Version:
Doc Type: Bug Fix
Doc Text:
Story Points: ---
Clone Of:
Environment:
Instance Name: Not Defined Build: CSProcessor Builder Version 1.6 Build Filter: null Build Name: Build Date: 18-09-2012 16:08:02
Last Closed: 2012-10-02 13:27:18 EDT
Type: Bug
Regression: ---
Mount Type: ---
Documentation: ---
CRM:
Verified Versions:
Category: ---
oVirt Team: ---
RHEL 7.3 requirements from Atomic Host:
Cloudforms Team: ---


Attachments (Terms of Use)

  None (edit)
Description Frederic Hornain 2012-10-02 13:03:13 EDT
Description of problem:

I followed the procedure to execute the "The CarMart Quickstart Using JBoss Application Server" Procedure - Chapter 9.4 in the Getting Started Guide
An introductory guide for JBoss Data Grid 6. Edition 1
-

Then I execute the folloxing command :

mvn clean package -Plibrary-jbossas -
Ddatagrid.maven.repo=file:///path/to/unpacked/jdg/maven/repository (with my proper maven repository path)

and i had the following error message :

/usr/lib/jvm/java
[INFO] Scanning for projects...
[INFO]                                                                         
[INFO] ------------------------------------------------------------------------
[INFO] Building CarMart Single Node (No Cluster) 1.0.1-redhat-1
[INFO] ------------------------------------------------------------------------
[WARNING] The POM for org.infinispan:infinispan-core:jar:5.1.7.Final-redhat-1 is missing, no dependency information available
[WARNING] The POM for org.jgroups:jgroups:jar:3.0.13.Final-redhat-1 is missing, no dependency information available
[WARNING] The POM for org.jboss.marshalling:jboss-marshalling-river:jar:1.3.14.GA-redhat-1 is missing, no dependency information available
[WARNING] The POM for org.jboss.marshalling:jboss-marshalling:jar:1.3.14.GA-redhat-1 is missing, no dependency information available
[WARNING] The POM for org.jboss.logging:jboss-logging:jar:3.1.1.GA-redhat-1 is missing, no dependency information available
[WARNING] The POM for org.codehaus.woodstox:woodstox-core-asl:jar:4.1.1-redhat-1 is missing, no dependency information available
[WARNING] The POM for org.codehaus.woodstox:stax2-api:jar:3.1.1-redhat-1 is missing, no dependency information available
[INFO] ------------------------------------------------------------------------
[INFO] BUILD FAILURE
[INFO] ------------------------------------------------------------------------
[INFO] Total time: 0.799s
[INFO] Finished at: Tue Oct 02 19:01:50 CEST 2012
[INFO] Final Memory: 5M/102M
[INFO] ------------------------------------------------------------------------
[ERROR] Failed to execute goal on project carmart-quickstart: Could not resolve dependencies for project com.jboss.datagrid.quickstart:carmart-quickstart:war:1.0.1-redhat-1: The following artifacts could not be resolved: org.infinispan:infinispan-core:jar:5.1.7.Final-redhat-1, org.jgroups:jgroups:jar:3.0.13.Final-redhat-1, org.jboss.marshalling:jboss-marshalling-river:jar:1.3.14.GA-redhat-1, org.jboss.marshalling:jboss-marshalling:jar:1.3.14.GA-redhat-1, org.jboss.logging:jboss-logging:jar:3.1.1.GA-redhat-1, org.codehaus.woodstox:woodstox-core-asl:jar:4.1.1-redhat-1, org.codehaus.woodstox:stax2-api:jar:3.1.1-redhat-1: Failure to find org.infinispan:infinispan-core:jar:5.1.7.Final-redhat-1 in https://repository.jboss.org/nexus/content/groups/public-jboss/ was cached in the local repository, resolution will not be reattempted until the update interval of jboss-public-repository-group has elapsed or updates are forced -> [Help 1]
[ERROR] 
[ERROR] To see the full stack trace of the errors, re-run Maven with the -e switch.
[ERROR] Re-run Maven using the -X switch to enable full debug logging.
[ERROR] 
[ERROR] For more information about the errors and possible solutions, please read the following articles:
[ERROR] [Help 1] http://cwiki.apache.org/confluence/display/MAVEN/DependencyResolutionException

Thanks for your support and your time
Comment 1 Frederic Hornain 2012-10-02 13:27:18 EDT
Dear *,

I found where my problem was.
The maven directory path was not set correctly.

Thanks anyway.

BR
/f

Note You need to log in before you can comment on or make changes to this bug.