Bugzilla (bugzilla.redhat.com) will be under maintenance for infrastructure upgrades and will not be available on July 31st between 12:30 AM - 05:30 AM UTC. We appreciate your understanding and patience. You can follow status.redhat.com for details.
Bug 1204238 - eu-central-1 rhel cloud 6.6 x86_64 hourly ami-ba0a37a7
Summary: eu-central-1 rhel cloud 6.6 x86_64 hourly ami-ba0a37a7
Keywords:
Status: CLOSED NOTABUG
Alias: None
Product: Cloud Image Validation
Classification: Red Hat
Component: images
Version: RHEL6.6
Hardware: x86_64
OS: Linux
unspecified
unspecified
Target Milestone: ---
Assignee: mkovacik
QA Contact: mkovacik
URL:
Whiteboard:
Depends On:
Blocks:
TreeView+ depends on / blocked
 
Reported: 2015-03-20 16:33 UTC by mkovacik
Modified: 2015-09-17 10:50 UTC (History)
0 users

Fixed In Version:
Doc Type: Bug Fix
Doc Text:
Clone Of:
Environment:
Last Closed: 2015-09-17 10:50:17 UTC
Target Upstream Version:


Attachments (Terms of Use)
ami-ba0a37a7-log.yaml (1.31 MB, text/yaml)
2015-03-20 16:34 UTC, mkovacik
no flags Details

Description mkovacik 2015-03-20 16:33:58 UTC

Comment 1 mkovacik 2015-03-20 16:34:15 UTC
Created attachment 1004560 [details]
ami-ba0a37a7-log.yaml

Comment 2 mkovacik 2015-03-20 16:34:17 UTC
# r3.large: waived
stage1:testcase_01_bash_history: waived
-
  command: [ ! -f ~root/DVA_OLD_BASH_HISTORY ] && echo 0 || cat
  ~root/DVA_OLD_BASH_HISTORY | wc -l
  result: passed
  expectation:   0
-
  command: [ ! -f ~ec2-user/DVA_OLD_BASH_HISTORY ] && echo 0 || cat
  ~ec2-user/DVA_OLD_BASH_HISTORY | wc -l
  result: failed
  actual: [ ! -f ~ec2-user/DVA_OLD_BASH_HISTORY ] && echo 0 || cat
  ~ec2-user/DVA_OLD_BASH_HISTORY | wc -l  2  [root@ip-172-31-15-136
  ~]#
  expectation:   0
-
  command: [ ! -f ~fedora/DVA_OLD_BASH_HISTORY ] && echo 0 || cat
  ~fedora/DVA_OLD_BASH_HISTORY | wc -l
  result: passed
  expectation:   0
-
  command: [ ! -f ~cloud-user/DVA_OLD_BASH_HISTORY ] && echo 0 || cat
  ~cloud-user/DVA_OLD_BASH_HISTORY | wc -l
  result: passed
  expectation:   0
stage1:testcase_19_rhn_system_id: passed
stage1:testcase_10_networking: passed
stage1:testcase_11_package_set: passed
stage1:testcase_41_rh_amazon_rhui_client: passed
stage1:testcase_03_running_services: passed
stage1:testcase_14_host_details: passed
stage1:testcase_39_root_is_locked: passed
stage1:testcase_23_syslog: passed
stage1:testcase_42_ipv6: passed
stage1:testcase_80_no_avc_denials: passed
stage1:testcase_62_cpuflags: passed
stage1:testcase_34_cpu: passed
stage1:testcase_35_console: passed
stage1:testcase_22_gpg_keys: passed
stage1:testcase_06_inittab: passed
stage1:testcase_360_ebs: passed
stage1:testcase_20_auditd: passed
stage1:testcase_30_rhn_certificates: passed
stage1:testcase_05_grub: passed
stage1:testcase_02_selinux_context: passed
stage1:testcase_07_libc6_xen_conf: passed
stage1:testcase_25_uname: passed
stage1:testcase_26_verify_rpms: passed
stage1:testcase_33_userdata: waived
-
  command: rpm -q --queryformat '%{NAME} ' cloud-init
  result: passed
  value: cloud-init
-
  command: ls -l /userdata_test
  result: failed
  actual: 2
-
  command: rpm -q xdelta
  result: failed
  actual: 1
stage1:testcase_16_selinux: passed
stage1:testcase_15_rhel_version: passed
stage1:testcase_12_passwd_group: passed
stage1:testcase_17_shells: passed
stage1:testcase_21_disk_size_format: passed
stage1:testcase_09_nameserver: passed
stage1:testcase_04_cloud_firstboot: passed
stage1:testcase_08_memory: passed
stage1:testcase_18_sshd: passed
stage1:testcase_24_yum_plugin: passed
stage1:testcase_32_ephemeral: passed
stage2:testcase_37_sshd_bug923996: passed
stage2:testcase_08_memory: passed
stage2:testcase_62_cpuflags: passed
stage2:testcase_25_uname: passed
stage2:testcase_80_no_avc_denials: passed

Comment 3 mkovacik 2015-03-20 16:34:18 UTC
# m3.2xlarge: waived
stage1:testcase_16_selinux: passed
stage1:testcase_34_cpu: passed
stage1:testcase_360_ebs: passed
stage1:testcase_35_console: passed
stage1:testcase_62_cpuflags: passed
stage1:testcase_39_root_is_locked: passed
stage1:testcase_42_ipv6: passed
stage1:testcase_02_selinux_context: passed
stage1:testcase_08_memory: passed
stage1:testcase_30_rhn_certificates: passed
stage1:testcase_20_auditd: passed
stage1:testcase_19_rhn_system_id: passed
stage1:testcase_22_gpg_keys: passed
stage1:testcase_23_syslog: passed
stage1:testcase_18_sshd: passed
stage1:testcase_80_no_avc_denials: passed
stage1:testcase_26_verify_rpms: passed
stage1:testcase_03_running_services: passed
stage1:testcase_10_networking: passed
stage1:testcase_09_nameserver: passed
stage1:testcase_17_shells: passed
stage1:testcase_06_inittab: passed
stage1:testcase_11_package_set: passed
stage1:testcase_14_host_details: passed
stage1:testcase_12_passwd_group: passed
stage1:testcase_15_rhel_version: passed
stage1:testcase_41_rh_amazon_rhui_client: passed
stage1:testcase_33_userdata: waived
-
  command: rpm -q --queryformat '%{NAME} ' cloud-init
  result: passed
  value: cloud-init
-
  command: ls -l /userdata_test
  result: failed
  actual: 2
-
  command: rpm -q xdelta
  result: failed
  actual: 1
stage1:testcase_04_cloud_firstboot: passed
stage1:testcase_05_grub: passed
stage1:testcase_25_uname: passed
stage1:testcase_01_bash_history: waived
-
  command: [ ! -f ~root/DVA_OLD_BASH_HISTORY ] && echo 0 || cat
  ~root/DVA_OLD_BASH_HISTORY | wc -l
  result: passed
  expectation:   0
-
  command: [ ! -f ~ec2-user/DVA_OLD_BASH_HISTORY ] && echo 0 || cat
  ~ec2-user/DVA_OLD_BASH_HISTORY | wc -l
  result: failed
  actual: [ ! -f ~ec2-user/DVA_OLD_BASH_HISTORY ] && echo 0 || cat
  ~ec2-user/DVA_OLD_BASH_HISTORY | wc -l  2  [root@ip-172-31-12-15 ~]#
  expectation:   0
-
  command: [ ! -f ~fedora/DVA_OLD_BASH_HISTORY ] && echo 0 || cat
  ~fedora/DVA_OLD_BASH_HISTORY | wc -l
  result: passed
  expectation:   0
-
  command: [ ! -f ~cloud-user/DVA_OLD_BASH_HISTORY ] && echo 0 || cat
  ~cloud-user/DVA_OLD_BASH_HISTORY | wc -l
  result: passed
  expectation:   0
stage1:testcase_21_disk_size_format: passed
stage1:testcase_07_libc6_xen_conf: passed
stage1:testcase_24_yum_plugin: passed
stage1:testcase_32_ephemeral: passed
stage2:testcase_62_cpuflags: passed
stage2:testcase_37_sshd_bug923996: passed
stage2:testcase_25_uname: passed
stage2:testcase_80_no_avc_denials: passed
stage2:testcase_08_memory: passed

Comment 4 mkovacik 2015-03-20 16:34:20 UTC
# t2.micro: waived
stage1:testcase_20_auditd: passed
stage1:testcase_23_syslog: passed
stage1:testcase_22_gpg_keys: passed
stage1:testcase_19_rhn_system_id: passed
stage1:testcase_80_no_avc_denials: passed
stage1:testcase_35_console: passed
stage1:testcase_39_root_is_locked: passed
stage1:testcase_360_ebs: passed
stage1:testcase_62_cpuflags: passed
stage1:testcase_41_rh_amazon_rhui_client: passed
stage1:testcase_42_ipv6: passed
stage1:testcase_14_host_details: passed
stage1:testcase_15_rhel_version: passed
stage1:testcase_17_shells: passed
stage1:testcase_06_inittab: passed
stage1:testcase_18_sshd: passed
stage1:testcase_21_disk_size_format: passed
stage1:testcase_02_selinux_context: passed
stage1:testcase_08_memory: passed
stage1:testcase_07_libc6_xen_conf: passed
stage1:testcase_34_cpu: passed
stage1:testcase_25_uname: passed
stage1:testcase_26_verify_rpms: passed
stage1:testcase_03_running_services: passed
stage1:testcase_05_grub: passed
stage1:testcase_11_package_set: passed
stage1:testcase_04_cloud_firstboot: passed
stage1:testcase_33_userdata: waived
-
  command: rpm -q --queryformat '%{NAME} ' cloud-init
  result: passed
  value: cloud-init
-
  command: ls -l /userdata_test
  result: failed
  actual: 2
-
  command: rpm -q xdelta
  result: failed
  actual: 1
stage1:testcase_16_selinux: passed
stage1:testcase_30_rhn_certificates: passed
stage1:testcase_09_nameserver: passed
stage1:testcase_12_passwd_group: passed
stage1:testcase_01_bash_history: waived
-
  command: [ ! -f ~root/DVA_OLD_BASH_HISTORY ] && echo 0 || cat
  ~root/DVA_OLD_BASH_HISTORY | wc -l
  result: passed
  expectation:   0
-
  command: [ ! -f ~ec2-user/DVA_OLD_BASH_HISTORY ] && echo 0 || cat
  ~ec2-user/DVA_OLD_BASH_HISTORY | wc -l
  result: failed
  actual: [ ! -f ~ec2-user/DVA_OLD_BASH_HISTORY ] && echo 0 || cat
  ~ec2-user/DVA_OLD_BASH_HISTORY | wc -l  2  [root@ip-172-31-1-171 ~]#
  expectation:   0
-
  command: [ ! -f ~fedora/DVA_OLD_BASH_HISTORY ] && echo 0 || cat
  ~fedora/DVA_OLD_BASH_HISTORY | wc -l
  result: passed
  expectation:   0
-
  command: [ ! -f ~cloud-user/DVA_OLD_BASH_HISTORY ] && echo 0 || cat
  ~cloud-user/DVA_OLD_BASH_HISTORY | wc -l
  result: passed
  expectation:   0
stage1:testcase_10_networking: passed
stage1:testcase_32_ephemeral: passed
stage1:testcase_24_yum_plugin: passed
stage2:testcase_62_cpuflags: passed
stage2:testcase_80_no_avc_denials: passed
stage2:testcase_08_memory: passed
stage2:testcase_25_uname: passed
stage2:testcase_37_sshd_bug923996: passed

Comment 5 mkovacik 2015-03-20 16:34:21 UTC
# i2.xlarge: waived
stage1:testcase_360_ebs: passed
stage1:testcase_39_root_is_locked: passed
stage1:testcase_34_cpu: passed
stage1:testcase_06_inittab: passed
stage1:testcase_80_no_avc_denials: passed
stage1:testcase_62_cpuflags: passed
stage1:testcase_42_ipv6: passed
stage1:testcase_02_selinux_context: passed
stage1:testcase_03_running_services: passed
stage1:testcase_04_cloud_firstboot: passed
stage1:testcase_07_libc6_xen_conf: passed
stage1:testcase_05_grub: passed
stage1:testcase_18_sshd: passed
stage1:testcase_19_rhn_system_id: passed
stage1:testcase_01_bash_history: waived
-
  command: [ ! -f ~root/DVA_OLD_BASH_HISTORY ] && echo 0 || cat
  ~root/DVA_OLD_BASH_HISTORY | wc -l
  result: passed
  expectation:   0
-
  command: [ ! -f ~ec2-user/DVA_OLD_BASH_HISTORY ] && echo 0 || cat
  ~ec2-user/DVA_OLD_BASH_HISTORY | wc -l
  result: failed
  actual: [ ! -f ~ec2-user/DVA_OLD_BASH_HISTORY ] && echo 0 || cat
  ~ec2-user/DVA_OLD_BASH_HISTORY | wc -l  2  [root@ip-172-31-9-200 ~]#
  expectation:   0
-
  command: [ ! -f ~fedora/DVA_OLD_BASH_HISTORY ] && echo 0 || cat
  ~fedora/DVA_OLD_BASH_HISTORY | wc -l
  result: passed
  expectation:   0
-
  command: [ ! -f ~cloud-user/DVA_OLD_BASH_HISTORY ] && echo 0 || cat
  ~cloud-user/DVA_OLD_BASH_HISTORY | wc -l
  result: passed
  expectation:   0
stage1:testcase_41_rh_amazon_rhui_client: passed
stage1:testcase_35_console: passed
stage1:testcase_21_disk_size_format: passed
stage1:testcase_20_auditd: passed
stage1:testcase_15_rhel_version: passed
stage1:testcase_33_userdata: waived
-
  command: rpm -q --queryformat '%{NAME} ' cloud-init
  result: passed
  value: cloud-init
-
  command: ls -l /userdata_test
  result: failed
  actual: 2
-
  command: rpm -q xdelta
  result: failed
  actual: 1
stage1:testcase_17_shells: passed
stage1:testcase_16_selinux: passed
stage1:testcase_23_syslog: passed
stage1:testcase_09_nameserver: passed
stage1:testcase_08_memory: passed
stage1:testcase_22_gpg_keys: passed
stage1:testcase_14_host_details: passed
stage1:testcase_26_verify_rpms: passed
stage1:testcase_25_uname: passed
stage1:testcase_30_rhn_certificates: passed
stage1:testcase_11_package_set: passed
stage1:testcase_12_passwd_group: passed
stage1:testcase_10_networking: passed
stage1:testcase_32_ephemeral: passed
stage1:testcase_24_yum_plugin: passed
stage2:testcase_80_no_avc_denials: passed
stage2:testcase_37_sshd_bug923996: passed
stage2:testcase_25_uname: passed
stage2:testcase_62_cpuflags: passed
stage2:testcase_08_memory: passed

Comment 6 mkovacik 2015-03-20 16:34:23 UTC
# i2.4xlarge: waived
stage1:testcase_80_no_avc_denials: passed
stage1:testcase_21_disk_size_format: passed
stage1:testcase_41_rh_amazon_rhui_client: passed
stage1:testcase_25_uname: passed
stage1:testcase_10_networking: passed
stage1:testcase_08_memory: passed
stage1:testcase_19_rhn_system_id: passed
stage1:testcase_18_sshd: passed
stage1:testcase_09_nameserver: passed
stage1:testcase_12_passwd_group: passed
stage1:testcase_15_rhel_version: passed
stage1:testcase_14_host_details: passed
stage1:testcase_07_libc6_xen_conf: passed
stage1:testcase_26_verify_rpms: passed
stage1:testcase_360_ebs: passed
stage1:testcase_22_gpg_keys: passed
stage1:testcase_20_auditd: passed
stage1:testcase_16_selinux: passed
stage1:testcase_39_root_is_locked: passed
stage1:testcase_30_rhn_certificates: passed
stage1:testcase_23_syslog: passed
stage1:testcase_06_inittab: passed
stage1:testcase_05_grub: passed
stage1:testcase_11_package_set: passed
stage1:testcase_42_ipv6: passed
stage1:testcase_01_bash_history: waived
-
  command: [ ! -f ~root/DVA_OLD_BASH_HISTORY ] && echo 0 || cat
  ~root/DVA_OLD_BASH_HISTORY | wc -l
  result: passed
  expectation:   0
-
  command: [ ! -f ~ec2-user/DVA_OLD_BASH_HISTORY ] && echo 0 || cat
  ~ec2-user/DVA_OLD_BASH_HISTORY | wc -l
  result: failed
  actual: [ ! -f ~ec2-user/DVA_OLD_BASH_HISTORY ] && echo 0 || cat
  ~ec2-user/DVA_OLD_BASH_HISTORY | wc -l  2  [root@ip-172-31-3-108 ~]#
  expectation:   0
-
  command: [ ! -f ~fedora/DVA_OLD_BASH_HISTORY ] && echo 0 || cat
  ~fedora/DVA_OLD_BASH_HISTORY | wc -l
  result: passed
  expectation:   0
-
  command: [ ! -f ~cloud-user/DVA_OLD_BASH_HISTORY ] && echo 0 || cat
  ~cloud-user/DVA_OLD_BASH_HISTORY | wc -l
  result: passed
  expectation:   0
stage1:testcase_02_selinux_context: passed
stage1:testcase_04_cloud_firstboot: passed
stage1:testcase_03_running_services: passed
stage1:testcase_62_cpuflags: passed
stage1:testcase_17_shells: passed
stage1:testcase_33_userdata: waived
-
  command: rpm -q --queryformat '%{NAME} ' cloud-init
  result: passed
  value: cloud-init
-
  command: ls -l /userdata_test
  result: failed
  actual: 2
-
  command: rpm -q xdelta
  result: failed
  actual: 1
stage1:testcase_34_cpu: passed
stage1:testcase_35_console: passed
stage1:testcase_32_ephemeral: passed
stage1:testcase_24_yum_plugin: passed
stage2:testcase_62_cpuflags: passed
stage2:testcase_37_sshd_bug923996: passed
stage2:testcase_80_no_avc_denials: passed
stage2:testcase_25_uname: passed
stage2:testcase_08_memory: passed

Comment 7 mkovacik 2015-03-20 16:34:24 UTC
# hs1.8xlarge: skip
-
  create_instance: skip Traceback (most recent call last):   File
  "build/bdist.linux-x86_64/egg/dva/work/stage.py", line 53, in
  wrapper     ret = fn(params)   File
  "build/bdist.linux-x86_64/egg/dva/work/params.py", line 31, in
  wrapper     return fn(params)   File
  "build/bdist.linux-x86_64/egg/dva/tools/retrying.py", line 35, in
  wrapper     return fn(*args, **kvs)   File
  "build/bdist.linux-x86_64/egg/dva/work/stage.py", line 110, in
  create_instance     raise SkipError(err) SkipError: got Unsupported
  - most likely the permanent error: EC2ResponseError: 400 Bad Request
  <?xml version="1.0" encoding="UTF-8"?>
  <Response><Errors><Error><Code>Unsupported</Code><Message>Your
  requested instance type (hs1.8xlarge) is not supported in this
  region (deep-space-9). Please retry your request in one of the
  following regions: us-east-1, eu-west-1, us-west-2, ap-northeast-1,
  ap-southeast-1, ap-southeast-2.</Message></Error></Errors><RequestID
  >c0d32459-4b7c-41b1-8bfb-376487a8d72b</RequestID></Response>

Comment 8 mkovacik 2015-03-20 16:34:26 UTC
# cr1.8xlarge: skip
-
  create_instance: skip Traceback (most recent call last):   File
  "build/bdist.linux-x86_64/egg/dva/work/stage.py", line 53, in
  wrapper     ret = fn(params)   File
  "build/bdist.linux-x86_64/egg/dva/work/params.py", line 31, in
  wrapper     return fn(params)   File
  "build/bdist.linux-x86_64/egg/dva/tools/retrying.py", line 35, in
  wrapper     return fn(*args, **kvs)   File
  "build/bdist.linux-x86_64/egg/dva/work/stage.py", line 110, in
  create_instance     raise SkipError(err) SkipError: got Unsupported
  - most likely the permanent error: EC2ResponseError: 400 Bad Request
  <?xml version="1.0" encoding="UTF-8"?>
  <Response><Errors><Error><Code>Unsupported</Code><Message>Your
  requested instance type (cr1.8xlarge) is not supported in this
  region (deep-space-9). Please retry your request in one of the
  following regions: us-east-1, eu-west-1, us-west-2, ap-northeast-1.<
  /Message></Error></Errors><RequestID>455697cc-69b3-424a-bf03-4e0a75c
  0d150</RequestID></Response>

Comment 9 mkovacik 2015-03-20 16:34:27 UTC
# r3.4xlarge: waived
stage1:testcase_02_selinux_context: passed
stage1:testcase_41_rh_amazon_rhui_client: passed
stage1:testcase_14_host_details: passed
stage1:testcase_34_cpu: passed
stage1:testcase_360_ebs: passed
stage1:testcase_25_uname: passed
stage1:testcase_33_userdata: waived
-
  command: rpm -q --queryformat '%{NAME} ' cloud-init
  result: passed
  value: cloud-init
-
  command: ls -l /userdata_test
  result: failed
  actual: 2
-
  command: rpm -q xdelta
  result: failed
  actual: 1
stage1:testcase_30_rhn_certificates: passed
stage1:testcase_39_root_is_locked: passed
stage1:testcase_23_syslog: passed
stage1:testcase_03_running_services: passed
stage1:testcase_09_nameserver: passed
stage1:testcase_17_shells: passed
stage1:testcase_07_libc6_xen_conf: passed
stage1:testcase_05_grub: passed
stage1:testcase_15_rhel_version: passed
stage1:testcase_12_passwd_group: passed
stage1:testcase_11_package_set: passed
stage1:testcase_80_no_avc_denials: passed
stage1:testcase_62_cpuflags: passed
stage1:testcase_42_ipv6: passed
stage1:testcase_35_console: passed
stage1:testcase_16_selinux: passed
stage1:testcase_04_cloud_firstboot: passed
stage1:testcase_06_inittab: passed
stage1:testcase_10_networking: passed
stage1:testcase_01_bash_history: waived
-
  command: [ ! -f ~root/DVA_OLD_BASH_HISTORY ] && echo 0 || cat
  ~root/DVA_OLD_BASH_HISTORY | wc -l
  result: passed
  expectation:   0
-
  command: [ ! -f ~ec2-user/DVA_OLD_BASH_HISTORY ] && echo 0 || cat
  ~ec2-user/DVA_OLD_BASH_HISTORY | wc -l
  result: failed
  actual: [ ! -f ~ec2-user/DVA_OLD_BASH_HISTORY ] && echo 0 || cat
  ~ec2-user/DVA_OLD_BASH_HISTORY | wc -l  2  [root@ip-172-31-12-31 ~]#
  expectation:   0
-
  command: [ ! -f ~fedora/DVA_OLD_BASH_HISTORY ] && echo 0 || cat
  ~fedora/DVA_OLD_BASH_HISTORY | wc -l
  result: passed
  expectation:   0
-
  command: [ ! -f ~cloud-user/DVA_OLD_BASH_HISTORY ] && echo 0 || cat
  ~cloud-user/DVA_OLD_BASH_HISTORY | wc -l
  result: passed
  expectation:   0
stage1:testcase_19_rhn_system_id: passed
stage1:testcase_08_memory: passed
stage1:testcase_20_auditd: passed
stage1:testcase_18_sshd: passed
stage1:testcase_21_disk_size_format: passed
stage1:testcase_26_verify_rpms: passed
stage1:testcase_22_gpg_keys: passed
stage1:testcase_24_yum_plugin: passed
stage1:testcase_32_ephemeral: passed
stage2:testcase_80_no_avc_denials: passed
stage2:testcase_08_memory: passed
stage2:testcase_62_cpuflags: passed
stage2:testcase_37_sshd_bug923996: passed
stage2:testcase_25_uname: passed

Comment 10 mkovacik 2015-03-20 16:34:29 UTC
# i2.2xlarge: waived
stage1:testcase_11_package_set: passed
stage1:testcase_42_ipv6: passed
stage1:testcase_30_rhn_certificates: passed
stage1:testcase_15_rhel_version: passed
stage1:testcase_12_passwd_group: passed
stage1:testcase_17_shells: passed
stage1:testcase_26_verify_rpms: passed
stage1:testcase_01_bash_history: waived
-
  command: [ ! -f ~root/DVA_OLD_BASH_HISTORY ] && echo 0 || cat
  ~root/DVA_OLD_BASH_HISTORY | wc -l
  result: passed
  expectation:   0
-
  command: [ ! -f ~ec2-user/DVA_OLD_BASH_HISTORY ] && echo 0 || cat
  ~ec2-user/DVA_OLD_BASH_HISTORY | wc -l
  result: failed
  actual: [ ! -f ~ec2-user/DVA_OLD_BASH_HISTORY ] && echo 0 || cat
  ~ec2-user/DVA_OLD_BASH_HISTORY | wc -l  2  [root@ip-172-31-1-2 ~]#
  expectation:   0
-
  command: [ ! -f ~fedora/DVA_OLD_BASH_HISTORY ] && echo 0 || cat
  ~fedora/DVA_OLD_BASH_HISTORY | wc -l
  result: passed
  expectation:   0
-
  command: [ ! -f ~cloud-user/DVA_OLD_BASH_HISTORY ] && echo 0 || cat
  ~cloud-user/DVA_OLD_BASH_HISTORY | wc -l
  result: passed
  expectation:   0
stage1:testcase_18_sshd: passed
stage1:testcase_41_rh_amazon_rhui_client: passed
stage1:testcase_33_userdata: waived
-
  command: rpm -q --queryformat '%{NAME} ' cloud-init
  result: passed
  value: cloud-init
-
  command: ls -l /userdata_test
  result: failed
  actual: 2
-
  command: rpm -q xdelta
  result: failed
  actual: 1
stage1:testcase_19_rhn_system_id: passed
stage1:testcase_35_console: passed
stage1:testcase_16_selinux: passed
stage1:testcase_06_inittab: passed
stage1:testcase_20_auditd: passed
stage1:testcase_03_running_services: passed
stage1:testcase_39_root_is_locked: passed
stage1:testcase_25_uname: passed
stage1:testcase_62_cpuflags: passed
stage1:testcase_22_gpg_keys: passed
stage1:testcase_05_grub: passed
stage1:testcase_21_disk_size_format: passed
stage1:testcase_02_selinux_context: passed
stage1:testcase_14_host_details: passed
stage1:testcase_80_no_avc_denials: passed
stage1:testcase_08_memory: passed
stage1:testcase_04_cloud_firstboot: passed
stage1:testcase_23_syslog: passed
stage1:testcase_34_cpu: passed
stage1:testcase_360_ebs: passed
stage1:testcase_09_nameserver: passed
stage1:testcase_10_networking: passed
stage1:testcase_07_libc6_xen_conf: passed
stage1:testcase_24_yum_plugin: passed
stage1:testcase_32_ephemeral: passed
stage2:testcase_25_uname: passed
stage2:testcase_08_memory: passed
stage2:testcase_80_no_avc_denials: passed
stage2:testcase_62_cpuflags: passed
stage2:testcase_37_sshd_bug923996: passed

Comment 11 mkovacik 2015-03-20 16:34:30 UTC
# cc2.8xlarge: skip
-
  create_instance: skip Traceback (most recent call last):   File
  "build/bdist.linux-x86_64/egg/dva/work/stage.py", line 53, in
  wrapper     ret = fn(params)   File
  "build/bdist.linux-x86_64/egg/dva/work/params.py", line 31, in
  wrapper     return fn(params)   File
  "build/bdist.linux-x86_64/egg/dva/tools/retrying.py", line 35, in
  wrapper     return fn(*args, **kvs)   File
  "build/bdist.linux-x86_64/egg/dva/work/stage.py", line 110, in
  create_instance     raise SkipError(err) SkipError: got Unsupported
  - most likely the permanent error: EC2ResponseError: 400 Bad Request
  <?xml version="1.0" encoding="UTF-8"?>
  <Response><Errors><Error><Code>Unsupported</Code><Message>Your
  requested instance type (cc2.8xlarge) is not supported in this
  region (deep-space-9). Please retry your request in one of the
  following regions: us-east-1, eu-west-1, us-west-2, ap-northeast-1, 
  us-gov-west-1.</Message></Error></Errors><RequestID>3cfb3be7-4932-4e
  ff-b061-5f68e429ebe8</RequestID></Response>

Comment 12 mkovacik 2015-03-20 16:34:31 UTC
# cg1.4xlarge: skip
-
  create_instance: skip Traceback (most recent call last):   File
  "build/bdist.linux-x86_64/egg/dva/work/stage.py", line 53, in
  wrapper     ret = fn(params)   File
  "build/bdist.linux-x86_64/egg/dva/work/params.py", line 31, in
  wrapper     return fn(params)   File
  "build/bdist.linux-x86_64/egg/dva/tools/retrying.py", line 35, in
  wrapper     return fn(*args, **kvs)   File
  "build/bdist.linux-x86_64/egg/dva/work/stage.py", line 110, in
  create_instance     raise SkipError(err) SkipError: got Unsupported
  - most likely the permanent error: EC2ResponseError: 400 Bad Request
  <?xml version="1.0" encoding="UTF-8"?>
  <Response><Errors><Error><Code>Unsupported</Code><Message>Your
  requested instance type (cg1.4xlarge) is not supported in this
  region (deep-space-9). Please retry your request in one of the
  following regions: us-east-1, eu-west-1.</Message></Error></Errors><
  RequestID>fcdd29e2-5c89-43fe-9180-5af437148735</RequestID></Response
  >

Comment 13 mkovacik 2015-03-20 16:34:33 UTC
# r3.8xlarge: waived
stage1:testcase_30_rhn_certificates: passed
stage1:testcase_80_no_avc_denials: passed
stage1:testcase_23_syslog: passed
stage1:testcase_08_memory: passed
stage1:testcase_34_cpu: passed
stage1:testcase_33_userdata: waived
-
  command: rpm -q --queryformat '%{NAME} ' cloud-init
  result: passed
  value: cloud-init
-
  command: ls -l /userdata_test
  result: failed
  actual: 2
-
  command: rpm -q xdelta
  result: failed
  actual: 1
stage1:testcase_42_ipv6: passed
stage1:testcase_62_cpuflags: passed
stage1:testcase_01_bash_history: waived
-
  command: [ ! -f ~root/DVA_OLD_BASH_HISTORY ] && echo 0 || cat
  ~root/DVA_OLD_BASH_HISTORY | wc -l
  result: passed
  expectation:   0
-
  command: [ ! -f ~ec2-user/DVA_OLD_BASH_HISTORY ] && echo 0 || cat
  ~ec2-user/DVA_OLD_BASH_HISTORY | wc -l
  result: failed
  actual: [ ! -f ~ec2-user/DVA_OLD_BASH_HISTORY ] && echo 0 || cat
  ~ec2-user/DVA_OLD_BASH_HISTORY | wc -l  2  [root@ip-172-31-5-159 ~]#
  expectation:   0
-
  command: [ ! -f ~fedora/DVA_OLD_BASH_HISTORY ] && echo 0 || cat
  ~fedora/DVA_OLD_BASH_HISTORY | wc -l
  result: passed
  expectation:   0
-
  command: [ ! -f ~cloud-user/DVA_OLD_BASH_HISTORY ] && echo 0 || cat
  ~cloud-user/DVA_OLD_BASH_HISTORY | wc -l
  result: passed
  expectation:   0
stage1:testcase_07_libc6_xen_conf: passed
stage1:testcase_06_inittab: passed
stage1:testcase_11_package_set: passed
stage1:testcase_10_networking: passed
stage1:testcase_05_grub: passed
stage1:testcase_03_running_services: passed
stage1:testcase_25_uname: passed
stage1:testcase_22_gpg_keys: passed
stage1:testcase_20_auditd: passed
stage1:testcase_21_disk_size_format: passed
stage1:testcase_04_cloud_firstboot: passed
stage1:testcase_18_sshd: passed
stage1:testcase_17_shells: passed
stage1:testcase_19_rhn_system_id: passed
stage1:testcase_09_nameserver: passed
stage1:testcase_02_selinux_context: passed
stage1:testcase_14_host_details: passed
stage1:testcase_16_selinux: passed
stage1:testcase_39_root_is_locked: passed
stage1:testcase_12_passwd_group: passed
stage1:testcase_26_verify_rpms: passed
stage1:testcase_41_rh_amazon_rhui_client: passed
stage1:testcase_35_console: passed
stage1:testcase_360_ebs: passed
stage1:testcase_15_rhel_version: passed
stage1:testcase_24_yum_plugin: passed
stage1:testcase_32_ephemeral: passed
stage2:testcase_80_no_avc_denials: passed
stage2:testcase_62_cpuflags: passed
stage2:testcase_08_memory: passed
stage2:testcase_37_sshd_bug923996: passed
stage2:testcase_25_uname: passed

Comment 14 mkovacik 2015-03-20 16:34:34 UTC
# r3.xlarge: waived
stage1:testcase_42_ipv6: passed
stage1:testcase_41_rh_amazon_rhui_client: passed
stage1:testcase_80_no_avc_denials: passed
stage1:testcase_26_verify_rpms: passed
stage1:testcase_09_nameserver: passed
stage1:testcase_10_networking: passed
stage1:testcase_04_cloud_firstboot: passed
stage1:testcase_20_auditd: passed
stage1:testcase_06_inittab: passed
stage1:testcase_35_console: passed
stage1:testcase_16_selinux: passed
stage1:testcase_17_shells: passed
stage1:testcase_21_disk_size_format: passed
stage1:testcase_23_syslog: passed
stage1:testcase_03_running_services: passed
stage1:testcase_02_selinux_context: passed
stage1:testcase_08_memory: passed
stage1:testcase_25_uname: passed
stage1:testcase_11_package_set: passed
stage1:testcase_34_cpu: passed
stage1:testcase_15_rhel_version: passed
stage1:testcase_01_bash_history: waived
-
  command: [ ! -f ~root/DVA_OLD_BASH_HISTORY ] && echo 0 || cat
  ~root/DVA_OLD_BASH_HISTORY | wc -l
  result: passed
  expectation:   0
-
  command: [ ! -f ~ec2-user/DVA_OLD_BASH_HISTORY ] && echo 0 || cat
  ~ec2-user/DVA_OLD_BASH_HISTORY | wc -l
  result: failed
  actual: [ ! -f ~ec2-user/DVA_OLD_BASH_HISTORY ] && echo 0 || cat
  ~ec2-user/DVA_OLD_BASH_HISTORY | wc -l  2  [root@ip-172-31-4-238 ~]#
  expectation:   0
-
  command: [ ! -f ~fedora/DVA_OLD_BASH_HISTORY ] && echo 0 || cat
  ~fedora/DVA_OLD_BASH_HISTORY | wc -l
  result: passed
  expectation:   0
-
  command: [ ! -f ~cloud-user/DVA_OLD_BASH_HISTORY ] && echo 0 || cat
  ~cloud-user/DVA_OLD_BASH_HISTORY | wc -l
  result: passed
  expectation:   0
stage1:testcase_30_rhn_certificates: passed
stage1:testcase_05_grub: passed
stage1:testcase_360_ebs: passed
stage1:testcase_22_gpg_keys: passed
stage1:testcase_14_host_details: passed
stage1:testcase_12_passwd_group: passed
stage1:testcase_07_libc6_xen_conf: passed
stage1:testcase_19_rhn_system_id: passed
stage1:testcase_18_sshd: passed
stage1:testcase_39_root_is_locked: passed
stage1:testcase_33_userdata: waived
-
  command: rpm -q --queryformat '%{NAME} ' cloud-init
  result: passed
  value: cloud-init
-
  command: ls -l /userdata_test
  result: failed
  actual: 2
-
  command: rpm -q xdelta
  result: failed
  actual: 1
stage1:testcase_62_cpuflags: passed
stage1:testcase_32_ephemeral: passed
stage1:testcase_24_yum_plugin: passed
stage2:testcase_25_uname: passed
stage2:testcase_62_cpuflags: passed
stage2:testcase_08_memory: passed
stage2:testcase_37_sshd_bug923996: passed
stage2:testcase_80_no_avc_denials: passed

Comment 15 mkovacik 2015-03-20 16:34:35 UTC
# t2.medium: waived
stage1:testcase_12_passwd_group: passed
stage1:testcase_360_ebs: passed
stage1:testcase_33_userdata: waived
-
  command: rpm -q --queryformat '%{NAME} ' cloud-init
  result: passed
  value: cloud-init
-
  command: ls -l /userdata_test
  result: failed
  actual: 2
-
  command: rpm -q xdelta
  result: failed
  actual: 1
stage1:testcase_25_uname: passed
stage1:testcase_26_verify_rpms: passed
stage1:testcase_08_memory: passed
stage1:testcase_19_rhn_system_id: passed
stage1:testcase_18_sshd: passed
stage1:testcase_14_host_details: passed
stage1:testcase_15_rhel_version: passed
stage1:testcase_07_libc6_xen_conf: passed
stage1:testcase_20_auditd: passed
stage1:testcase_21_disk_size_format: passed
stage1:testcase_02_selinux_context: passed
stage1:testcase_04_cloud_firstboot: passed
stage1:testcase_03_running_services: passed
stage1:testcase_10_networking: passed
stage1:testcase_05_grub: passed
stage1:testcase_06_inittab: passed
stage1:testcase_23_syslog: passed
stage1:testcase_01_bash_history: waived
-
  command: [ ! -f ~root/DVA_OLD_BASH_HISTORY ] && echo 0 || cat
  ~root/DVA_OLD_BASH_HISTORY | wc -l
  result: passed
  expectation:   0
-
  command: [ ! -f ~ec2-user/DVA_OLD_BASH_HISTORY ] && echo 0 || cat
  ~ec2-user/DVA_OLD_BASH_HISTORY | wc -l
  result: failed
  actual: [ ! -f ~ec2-user/DVA_OLD_BASH_HISTORY ] && echo 0 || cat
  ~ec2-user/DVA_OLD_BASH_HISTORY | wc -l  2  [root@ip-172-31-4-40 ~]#
  expectation:   0
-
  command: [ ! -f ~fedora/DVA_OLD_BASH_HISTORY ] && echo 0 || cat
  ~fedora/DVA_OLD_BASH_HISTORY | wc -l
  result: passed
  expectation:   0
-
  command: [ ! -f ~cloud-user/DVA_OLD_BASH_HISTORY ] && echo 0 || cat
  ~cloud-user/DVA_OLD_BASH_HISTORY | wc -l
  result: passed
  expectation:   0
stage1:testcase_16_selinux: passed
stage1:testcase_22_gpg_keys: passed
stage1:testcase_09_nameserver: passed
stage1:testcase_34_cpu: passed
stage1:testcase_35_console: passed
stage1:testcase_41_rh_amazon_rhui_client: passed
stage1:testcase_17_shells: passed
stage1:testcase_39_root_is_locked: passed
stage1:testcase_30_rhn_certificates: passed
stage1:testcase_11_package_set: passed
stage1:testcase_80_no_avc_denials: passed
stage1:testcase_42_ipv6: passed
stage1:testcase_62_cpuflags: passed
stage1:testcase_32_ephemeral: passed
stage1:testcase_24_yum_plugin: passed
stage2:testcase_08_memory: passed
stage2:testcase_62_cpuflags: passed
stage2:testcase_80_no_avc_denials: passed
stage2:testcase_37_sshd_bug923996: passed
stage2:testcase_25_uname: passed

Comment 16 mkovacik 2015-03-20 16:34:37 UTC
# t2.small: waived
stage1:testcase_02_selinux_context: passed
stage1:testcase_42_ipv6: passed
stage1:testcase_39_root_is_locked: passed
stage1:testcase_30_rhn_certificates: passed
stage1:testcase_62_cpuflags: passed
stage1:testcase_14_host_details: passed
stage1:testcase_35_console: passed
stage1:testcase_80_no_avc_denials: passed
stage1:testcase_06_inittab: passed
stage1:testcase_09_nameserver: passed
stage1:testcase_08_memory: passed
stage1:testcase_360_ebs: passed
stage1:testcase_16_selinux: passed
stage1:testcase_15_rhel_version: passed
stage1:testcase_34_cpu: passed
stage1:testcase_05_grub: passed
stage1:testcase_33_userdata: waived
-
  command: rpm -q --queryformat '%{NAME} ' cloud-init
  result: passed
  value: cloud-init
-
  command: ls -l /userdata_test
  result: failed
  actual: 2
-
  command: rpm -q xdelta
  result: failed
  actual: 1
stage1:testcase_19_rhn_system_id: passed
stage1:testcase_11_package_set: passed
stage1:testcase_22_gpg_keys: passed
stage1:testcase_10_networking: passed
stage1:testcase_17_shells: passed
stage1:testcase_04_cloud_firstboot: passed
stage1:testcase_23_syslog: passed
stage1:testcase_07_libc6_xen_conf: passed
stage1:testcase_26_verify_rpms: passed
stage1:testcase_41_rh_amazon_rhui_client: passed
stage1:testcase_25_uname: passed
stage1:testcase_03_running_services: passed
stage1:testcase_20_auditd: passed
stage1:testcase_21_disk_size_format: passed
stage1:testcase_12_passwd_group: passed
stage1:testcase_01_bash_history: waived
-
  command: [ ! -f ~root/DVA_OLD_BASH_HISTORY ] && echo 0 || cat
  ~root/DVA_OLD_BASH_HISTORY | wc -l
  result: passed
  expectation:   0
-
  command: [ ! -f ~ec2-user/DVA_OLD_BASH_HISTORY ] && echo 0 || cat
  ~ec2-user/DVA_OLD_BASH_HISTORY | wc -l
  result: failed
  actual: [ ! -f ~ec2-user/DVA_OLD_BASH_HISTORY ] && echo 0 || cat
  ~ec2-user/DVA_OLD_BASH_HISTORY | wc -l  2  [root@ip-172-31-4-211 ~]#
  expectation:   0
-
  command: [ ! -f ~fedora/DVA_OLD_BASH_HISTORY ] && echo 0 || cat
  ~fedora/DVA_OLD_BASH_HISTORY | wc -l
  result: passed
  expectation:   0
-
  command: [ ! -f ~cloud-user/DVA_OLD_BASH_HISTORY ] && echo 0 || cat
  ~cloud-user/DVA_OLD_BASH_HISTORY | wc -l
  result: passed
  expectation:   0
stage1:testcase_18_sshd: passed
stage1:testcase_24_yum_plugin: passed
stage1:testcase_32_ephemeral: passed
stage2:testcase_08_memory: passed
stage2:testcase_37_sshd_bug923996: passed
stage2:testcase_62_cpuflags: passed
stage2:testcase_25_uname: passed
stage2:testcase_80_no_avc_denials: passed

Comment 17 mkovacik 2015-03-20 16:34:38 UTC
# hi1.4xlarge: skip
-
  create_instance: skip Traceback (most recent call last):   File
  "build/bdist.linux-x86_64/egg/dva/work/stage.py", line 53, in
  wrapper     ret = fn(params)   File
  "build/bdist.linux-x86_64/egg/dva/work/params.py", line 31, in
  wrapper     return fn(params)   File
  "build/bdist.linux-x86_64/egg/dva/tools/retrying.py", line 35, in
  wrapper     return fn(*args, **kvs)   File
  "build/bdist.linux-x86_64/egg/dva/work/stage.py", line 110, in
  create_instance     raise SkipError(err) SkipError: got Unsupported
  - most likely the permanent error: EC2ResponseError: 400 Bad Request
  <?xml version="1.0" encoding="UTF-8"?>
  <Response><Errors><Error><Code>Unsupported</Code><Message>Your
  requested instance type (hi1.4xlarge) is not supported in this
  region (deep-space-9). Please retry your request in one of the
  following regions: us-east-1, eu-west-1, us-west-2, ap-southeast-1.<
  /Message></Error></Errors><RequestID>98cdcaa5-0e13-4dde-a02a-c3e4c4f
  2c7ca</RequestID></Response>

Comment 18 mkovacik 2015-03-20 16:34:39 UTC
# i2.8xlarge: waived
stage1:testcase_22_gpg_keys: passed
stage1:testcase_41_rh_amazon_rhui_client: passed
stage1:testcase_18_sshd: passed
stage1:testcase_34_cpu: passed
stage1:testcase_35_console: passed
stage1:testcase_14_host_details: passed
stage1:testcase_12_passwd_group: passed
stage1:testcase_360_ebs: passed
stage1:testcase_10_networking: passed
stage1:testcase_16_selinux: passed
stage1:testcase_80_no_avc_denials: passed
stage1:testcase_08_memory: passed
stage1:testcase_09_nameserver: passed
stage1:testcase_06_inittab: passed
stage1:testcase_33_userdata: waived
-
  command: rpm -q --queryformat '%{NAME} ' cloud-init
  result: passed
  value: rpmdb: Thread/process 2188/140475491628800 failed: Thread
  died in Berkeley DB library  error: db3 error(-30974) from
  dbenv->failchk: DB_RUNRECOVERY: Fatal error, run database recovery
  error: cannot open Packages index using db3 -  (-30974)  error:
  cannot open Packages database in /var/lib/rpm  cloud-init
-
  result: skip
  comment: no cloud-init package
stage1:testcase_30_rhn_certificates: passed
stage1:testcase_01_bash_history: waived
-
  command: [ ! -f ~root/DVA_OLD_BASH_HISTORY ] && echo 0 || cat
  ~root/DVA_OLD_BASH_HISTORY | wc -l
  result: passed
  expectation:   0
-
  command: [ ! -f ~ec2-user/DVA_OLD_BASH_HISTORY ] && echo 0 || cat
  ~ec2-user/DVA_OLD_BASH_HISTORY | wc -l
  result: failed
  actual: [ ! -f ~ec2-user/DVA_OLD_BASH_HISTORY ] && echo 0 || cat
  ~ec2-user/DVA_OLD_BASH_HISTORY | wc -l  2  [root@ip-172-31-13-174
  ~]#
  expectation:   0
-
  command: [ ! -f ~fedora/DVA_OLD_BASH_HISTORY ] && echo 0 || cat
  ~fedora/DVA_OLD_BASH_HISTORY | wc -l
  result: passed
  expectation:   0
-
  command: [ ! -f ~cloud-user/DVA_OLD_BASH_HISTORY ] && echo 0 || cat
  ~cloud-user/DVA_OLD_BASH_HISTORY | wc -l
  result: passed
  expectation:   0
stage1:testcase_26_verify_rpms: passed
stage1:testcase_25_uname: passed
stage1:testcase_17_shells: passed
stage1:testcase_11_package_set: passed
stage1:testcase_39_root_is_locked: passed
stage1:testcase_15_rhel_version: passed
stage1:testcase_23_syslog: passed
stage1:testcase_05_grub: passed
stage1:testcase_19_rhn_system_id: passed
stage1:testcase_21_disk_size_format: passed
stage1:testcase_07_libc6_xen_conf: passed
stage1:testcase_04_cloud_firstboot: passed
stage1:testcase_02_selinux_context: passed
stage1:testcase_42_ipv6: passed
stage1:testcase_20_auditd: passed
stage1:testcase_03_running_services: passed
stage1:testcase_62_cpuflags: passed
stage1:testcase_24_yum_plugin: passed
stage1:testcase_32_ephemeral: passed
stage2:testcase_25_uname: passed
stage2:testcase_62_cpuflags: passed
stage2:testcase_80_no_avc_denials: passed
stage2:testcase_37_sshd_bug923996: passed
stage2:testcase_08_memory: passed

Comment 19 mkovacik 2015-03-20 16:34:41 UTC
# r3.2xlarge: waived
stage1:testcase_22_gpg_keys: passed
stage1:testcase_25_uname: passed
stage1:testcase_04_cloud_firstboot: passed
stage1:testcase_17_shells: passed
stage1:testcase_18_sshd: passed
stage1:testcase_16_selinux: passed
stage1:testcase_360_ebs: passed
stage1:testcase_23_syslog: passed
stage1:testcase_01_bash_history: waived
-
  command: [ ! -f ~root/DVA_OLD_BASH_HISTORY ] && echo 0 || cat
  ~root/DVA_OLD_BASH_HISTORY | wc -l
  result: passed
  expectation:   0
-
  command: [ ! -f ~ec2-user/DVA_OLD_BASH_HISTORY ] && echo 0 || cat
  ~ec2-user/DVA_OLD_BASH_HISTORY | wc -l
  result: failed
  actual: [ ! -f ~ec2-user/DVA_OLD_BASH_HISTORY ] && echo 0 || cat
  ~ec2-user/DVA_OLD_BASH_HISTORY | wc -l  2  [root@ip-172-31-6-218 ~]#
  expectation:   0
-
  command: [ ! -f ~fedora/DVA_OLD_BASH_HISTORY ] && echo 0 || cat
  ~fedora/DVA_OLD_BASH_HISTORY | wc -l
  result: passed
  expectation:   0
-
  command: [ ! -f ~cloud-user/DVA_OLD_BASH_HISTORY ] && echo 0 || cat
  ~cloud-user/DVA_OLD_BASH_HISTORY | wc -l
  result: passed
  expectation:   0
stage1:testcase_30_rhn_certificates: passed
stage1:testcase_21_disk_size_format: passed
stage1:testcase_80_no_avc_denials: passed
stage1:testcase_20_auditd: passed
stage1:testcase_41_rh_amazon_rhui_client: passed
stage1:testcase_14_host_details: passed
stage1:testcase_06_inittab: passed
stage1:testcase_15_rhel_version: passed
stage1:testcase_09_nameserver: passed
stage1:testcase_26_verify_rpms: passed
stage1:testcase_03_running_services: passed
stage1:testcase_07_libc6_xen_conf: passed
stage1:testcase_33_userdata: waived
-
  command: rpm -q --queryformat '%{NAME} ' cloud-init
  result: passed
  value: cloud-init
-
  command: ls -l /userdata_test
  result: failed
  actual: 2
-
  command: rpm -q xdelta
  result: failed
  actual: 1
stage1:testcase_05_grub: passed
stage1:testcase_42_ipv6: passed
stage1:testcase_19_rhn_system_id: passed
stage1:testcase_12_passwd_group: passed
stage1:testcase_35_console: passed
stage1:testcase_34_cpu: passed
stage1:testcase_08_memory: passed
stage1:testcase_10_networking: passed
stage1:testcase_11_package_set: passed
stage1:testcase_62_cpuflags: passed
stage1:testcase_39_root_is_locked: passed
stage1:testcase_02_selinux_context: passed
stage1:testcase_32_ephemeral: passed
stage1:testcase_24_yum_plugin: passed
stage2:testcase_08_memory: passed
stage2:testcase_37_sshd_bug923996: passed
stage2:testcase_62_cpuflags: passed
stage2:testcase_80_no_avc_denials: passed
stage2:testcase_25_uname: passed

Comment 20 mkovacik 2015-03-20 16:34:42 UTC
# m3.xlarge: waived
stage1:testcase_35_console: passed
stage1:testcase_21_disk_size_format: passed
stage1:testcase_17_shells: passed
stage1:testcase_34_cpu: passed
stage1:testcase_360_ebs: passed
stage1:testcase_19_rhn_system_id: passed
stage1:testcase_08_memory: passed
stage1:testcase_62_cpuflags: passed
stage1:testcase_15_rhel_version: passed
stage1:testcase_05_grub: passed
stage1:testcase_12_passwd_group: passed
stage1:testcase_06_inittab: passed
stage1:testcase_23_syslog: passed
stage1:testcase_09_nameserver: passed
stage1:testcase_02_selinux_context: passed
stage1:testcase_04_cloud_firstboot: passed
stage1:testcase_10_networking: passed
stage1:testcase_16_selinux: passed
stage1:testcase_20_auditd: passed
stage1:testcase_14_host_details: passed
stage1:testcase_26_verify_rpms: passed
stage1:testcase_39_root_is_locked: passed
stage1:testcase_22_gpg_keys: passed
stage1:testcase_30_rhn_certificates: passed
stage1:testcase_03_running_services: passed
stage1:testcase_33_userdata: waived
-
  command: rpm -q --queryformat '%{NAME} ' cloud-init
  result: passed
  value: rpmdb: Thread/process 2606/139929608918944 failed: Thread
  died in Berkeley DB library  error: db3 error(-30974) from
  dbenv->failchk: DB_RUNRECOVERY: Fatal error, run database recovery
  error: cannot open Packages index using db3 -  (-30974)  error:
  cannot open Packages database in /var/lib/rpm  cloud-init
-
  result: skip
  comment: no cloud-init package
stage1:testcase_42_ipv6: passed
stage1:testcase_18_sshd: passed
stage1:testcase_01_bash_history: waived
-
  command: [ ! -f ~root/DVA_OLD_BASH_HISTORY ] && echo 0 || cat
  ~root/DVA_OLD_BASH_HISTORY | wc -l
  result: passed
  expectation:   0
-
  command: [ ! -f ~ec2-user/DVA_OLD_BASH_HISTORY ] && echo 0 || cat
  ~ec2-user/DVA_OLD_BASH_HISTORY | wc -l
  result: failed
  actual: [ ! -f ~ec2-user/DVA_OLD_BASH_HISTORY ] && echo 0 || cat
  ~ec2-user/DVA_OLD_BASH_HISTORY | wc -l  2  [root@ip-172-31-5-137 ~]#
  expectation:   0
-
  command: [ ! -f ~fedora/DVA_OLD_BASH_HISTORY ] && echo 0 || cat
  ~fedora/DVA_OLD_BASH_HISTORY | wc -l
  result: passed
  expectation:   0
-
  command: [ ! -f ~cloud-user/DVA_OLD_BASH_HISTORY ] && echo 0 || cat
  ~cloud-user/DVA_OLD_BASH_HISTORY | wc -l
  result: passed
  expectation:   0
stage1:testcase_80_no_avc_denials: passed
stage1:testcase_11_package_set: passed
stage1:testcase_41_rh_amazon_rhui_client: passed
stage1:testcase_07_libc6_xen_conf: passed
stage1:testcase_25_uname: passed
stage1:testcase_32_ephemeral: passed
stage1:testcase_24_yum_plugin: passed
stage2:testcase_08_memory: passed
stage2:testcase_37_sshd_bug923996: passed
stage2:testcase_25_uname: passed
stage2:testcase_80_no_avc_denials: passed
stage2:testcase_62_cpuflags: passed

Comment 21 mkovacik 2015-03-20 16:34:44 UTC
# cc1.4xlarge: skip
-
  create_instance: skip Traceback (most recent call last):   File
  "build/bdist.linux-x86_64/egg/dva/work/stage.py", line 53, in
  wrapper     ret = fn(params)   File
  "build/bdist.linux-x86_64/egg/dva/work/params.py", line 31, in
  wrapper     return fn(params)   File
  "build/bdist.linux-x86_64/egg/dva/tools/retrying.py", line 35, in
  wrapper     return fn(*args, **kvs)   File
  "build/bdist.linux-x86_64/egg/dva/work/stage.py", line 110, in
  create_instance     raise SkipError(err) SkipError: got Unsupported
  - most likely the permanent error: EC2ResponseError: 400 Bad Request
  <?xml version="1.0" encoding="UTF-8"?>
  <Response><Errors><Error><Code>Unsupported</Code><Message>Your
  requested instance type (cc1.4xlarge) is not supported in this
  region (deep-space-9). Please retry your request in one of the
  following regions: us-east-1.</Message></Error></Errors><RequestID>9
  06b206e-550f-4acc-88f7-94d28ee95b08</RequestID></Response>

Comment 22 mkovacik 2015-09-17 10:50:17 UTC
Obsoleted ami validation bugs from on_qa -> closed not a bug


Note You need to log in before you can comment on or make changes to this bug.