Bug 1468077 - Transmission-gtk: Update to support openssl 1.1 (rather than the compat package)
Transmission-gtk: Update to support openssl 1.1 (rather than the compat package)
Status: ASSIGNED
Product: Fedora
Classification: Fedora
Component: transmission (Show other bugs)
26
Unspecified Unspecified
unspecified Severity unspecified
: ---
: ---
Assigned To: Gwyn Ciesla
Fedora Extras Quality Assurance
:
Depends On:
Blocks:
  Show dependency treegraph
 
Reported: 2017-07-05 20:39 EDT by abrouwers
Modified: 2017-08-08 11:13 EDT (History)
8 users (show)

See Also:
Fixed In Version:
Doc Type: If docs needed, set a value
Doc Text:
Story Points: ---
Clone Of:
Environment:
Last Closed:
Type: Bug
Regression: ---
Mount Type: ---
Documentation: ---
CRM:
Verified Versions:
Category: ---
oVirt Team: ---
RHEL 7.3 requirements from Atomic Host:
Cloudforms Team: ---


Attachments (Terms of Use)

  None (edit)
Description abrouwers 2017-07-05 20:39:10 EDT
Description of problem:

Transmission was changed to simply depend on the older openssl 1.0 - debian has patches backported to support openssl 1.1, and shipping the package in the latest release:

https://anonscm.debian.org/cgit/collab-maint/transmission.git/tree/debian/patches
Comment 1 Gwyn Ciesla 2017-08-08 11:13:57 EDT
I applied the two relevant patches, and it doesn't build on rawhide:

crypto-utils-openssl.c: In function 'tr_dh_new':
crypto-utils-openssl.c:244:29: error: dereferencing pointer to incomplete type 'DH {aka struct dh_st}'
   if (!check_pointer (handle->p = BN_bin2bn (prime_num, prime_num_length, NULL)) ||
                             ^
crypto-utils-openssl.c:92:56: note: in definition of macro 'check_pointer'
 #define check_pointer(pointer) check_openssl_pointer ((pointer), __FILE__, __LINE__)
                                                        ^~~~~~~
make[1]: *** [Makefile:1253: crypto-utils-openssl.o] Error 1
make[1]: *** Waiting for unfinished jobs....
make[1]: Leaving directory '/home/limb/fedora/git/transmission/transmission-2.92/libtransmission'
make: *** [Makefile:507: all-recursive] Error 1
error: Bad exit status from /var/tmp/rpm-tmp.2c5zlk (%build)

Note You need to log in before you can comment on or make changes to this bug.