Bug 1475561 - Some tests fail on s390x
Some tests fail on s390x
Status: NEW
Product: Fedora
Classification: Fedora
Component: vkmark (Show other bugs)
27
s390x Unspecified
unspecified Severity unspecified
: ---
: ---
Assigned To: Yanko Kaneti
Fedora Extras Quality Assurance
:
Depends On:
Blocks: F-ExcludeArch-s390x
  Show dependency treegraph
 
Reported: 2017-07-26 18:01 EDT by Yanko Kaneti
Modified: 2017-08-15 05:01 EDT (History)
2 users (show)

See Also:
Fixed In Version:
Doc Type: If docs needed, set a value
Doc Text:
Story Points: ---
Clone Of:
Environment:
Last Closed:
Type: Bug
Regression: ---
Mount Type: ---
Documentation: ---
CRM:
Verified Versions:
Category: ---
oVirt Team: ---
RHEL 7.3 requirements from Atomic Host:
Cloudforms Team: ---


Attachments (Terms of Use)

  None (edit)
Description Yanko Kaneti 2017-07-26 18:01:00 EDT
......
Executing(%check): /bin/sh -e /var/tmp/rpm-tmp.quom21
+ umask 022
+ cd /builddir/build/BUILD
+ cd vkmark-aa0de26fff41524489b06e32151ac605081c774b
+ /usr/bin/ninja test -v -j2 -C s390x-redhat-linux-gnu
ninja: Entering directory `s390x-redhat-linux-gnu'
[0/1] /usr/bin/python3 -u /usr/bin/mesontest --no-rebuild --print-errorlogs
1/1 vkmark tests                            FAIL     1.39 s
OK:         0
FAIL:       1
SKIP:       0
TIMEOUT:    0
The output from the failed tests:
1/1 vkmark tests                            FAIL     1.39 s
--- command ---
/builddir/build/BUILD/vkmark-aa0de26fff41524489b06e32151ac605081c774b/s390x-redhat-linux-gnu/tests/vkmark-tests
--- stdout ---
Warning: Scene 'test_scene_1' doesn't accept option 'testoptinvalid'
Warning: Scene 'test_scene_1' doesn't accept option 'testoptinvalid1'
~~~~~~~~~~~~~~~~~~~~~~~~~~~~~~~~~~~~~~~~~~~~~~~~~~~~~~~~~~~~~~~~~~~~~~~~~~~~~~~
vkmark-tests is a Catch v1.9.6 host application.
Run with -? for options
-------------------------------------------------------------------------------
Scenario: model to mesh
     Given: A model with rectangle faces
-------------------------------------------------------------------------------
../tests/model_test.cpp:87
...............................................................................
../tests/model_test.cpp:87: FAILED:
due to unexpected exception with message:
  Failed to parse model string of type ply
-------------------------------------------------------------------------------
Scenario: model to mesh
     Given: A model with colors
-------------------------------------------------------------------------------
../tests/model_test.cpp:158
...............................................................................
../tests/model_test.cpp:158: FAILED:
due to unexpected exception with message:
  Failed to parse model string of type ply
-------------------------------------------------------------------------------
Scenario: model to mesh
     Given: A model with multiple vertex attributes
-------------------------------------------------------------------------------
../tests/model_test.cpp:198
...............................................................................
../tests/model_test.cpp:198: FAILED:
due to unexpected exception with message:
  Failed to parse model string of type ply
===============================================================================
test cases:  14 |  13 passed | 1 failed
assertions: 176 | 173 passed | 3 failed
--- stderr ---
vkmark: unrecognized option '--invalid'
-------
Full log written to /builddir/build/BUILD/vkmark-aa0de26fff41524489b06e32151ac605081c774b/s390x-redhat-linux-gnu/meson-logs/testlog.txt
FAILED: test 
/usr/bin/python3 -u /usr/bin/mesontest --no-rebuild --print-errorlogs
ninja: build stopped: subcommand failed.
....
Comment 1 Jan Kurik 2017-08-15 05:01:09 EDT
This bug appears to have been reported against 'rawhide' during the Fedora 27 development cycle.
Changing version to '27'.

Note You need to log in before you can comment on or make changes to this bug.