Bug 157443 - Missing BuildRequires dependency
Missing BuildRequires dependency
Product: Red Hat Enterprise Linux 3
Classification: Red Hat
Component: openmotif21 (Show other bugs)
All Linux
medium Severity medium
: ---
: ---
Assigned To: Thomas Woerner
Depends On:
  Show dependency treegraph
Reported: 2005-05-11 14:05 EDT by Andreas Thienemann
Modified: 2007-11-30 17:07 EST (History)
0 users

See Also:
Fixed In Version:
Doc Type: Bug Fix
Doc Text:
Story Points: ---
Clone Of:
Last Closed: 2005-05-13 15:50:57 EDT
Type: ---
Regression: ---
Mount Type: ---
Documentation: ---
Verified Versions:
Category: ---
oVirt Team: ---
RHEL 7.3 requirements from Atomic Host:
Cloudforms Team: ---

Attachments (Terms of Use)

  None (edit)
Description Andreas Thienemann 2005-05-11 14:05:12 EDT
The specfile for openmotif21-2.1.30-9.RHEL3.6 needs a Build-dependency on

Without it make complains:

imake.c:155:21: Xosdefs.h: No such file or directory
make[2]: *** [imake.o] Error 1
make[2]: Leaving directory `/usr/src/rpm/BUILD/motif/config/imake'
make[1]: *** [imake.proto] Error 2
make[1]: Leaving directory `/usr/src/rpm/BUILD/motif'
make: *** [World] Error 2
error: Bad exit status from /var/tmp/rpm-tmp.21713 (%build)
Comment 1 Andreas Thienemann 2005-05-13 15:50:57 EDT
seems to be resolved with the current yum release in rawhide.

marking resolved.

Note You need to log in before you can comment on or make changes to this bug.