Note: This bug is displayed in read-only format because
the product is no longer active in Red Hat Bugzilla.
| Summary: |
[UPGRADES][12] nova-manage: error: unrecognized arguments: --by-service |
| Product: |
Red Hat OpenStack
|
Reporter: |
Yurii Prokulevych <yprokule> |
| Component: |
openstack-nova | Assignee: |
OSP DFG:Compute <osp-dfg-compute> |
| Status: |
CLOSED
NOTABUG
|
QA Contact: |
OSP DFG:Compute <osp-dfg-compute> |
| Severity: |
urgent
|
Docs Contact: |
|
| Priority: |
urgent
|
|
|
| Version: |
12.0 (Pike) | CC: |
augol, berrange, ccamacho, dasmith, eglynn, jhakimra, kchamart, lyarwood, mschuppe, sbauza, sferdjao, sgordon, srevivo, vromanso, yprokule
|
| Target Milestone: |
--- | Keywords: |
Triaged, ZStream |
| Target Release: |
--- | |
|
| Hardware: |
Unspecified | |
|
| OS: |
Unspecified | |
|
| Whiteboard: |
|
|
Fixed In Version:
|
|
Doc Type:
|
If docs needed, set a value
|
|
Doc Text:
|
|
Story Points:
|
---
|
|
Clone Of:
|
|
Environment:
|
|
|
Last Closed:
|
2018-07-20 09:16:02 UTC
|
Type:
|
Bug
|
|
Regression:
|
---
|
Mount Type:
|
---
|
|
Documentation:
|
---
|
CRM:
|
|
|
Verified Versions:
|
|
Category:
|
---
|
|
oVirt Team:
|
---
|
RHEL 7.3 requirements from Atomic Host:
|
|
|
Cloudforms Team:
|
---
|
Target Upstream Version:
|
|
|
Embargoed:
|
|
| |
Description of problem: ----------------------- Upgrade from RHOS-11 to RHOS-12 fails openstack overcloud deploy \ --timeout 100 \ --templates /usr/share/openstack-tripleo-heat-templates \ --stack overcloud \ --libvirt-type kvm \ --ntp-server clock.redhat.com \ -e /usr/share/openstack-tripleo-heat-templates/environments/storage-environment.yaml \ -e /home/stack/virt/internal.yaml \ -e /usr/share/openstack-tripleo-heat-templates/environments/network-isolation.yaml \ -e /home/stack/virt/network/network-environment.yaml \ -e /home/stack/virt/enable-tls.yaml \ -e /home/stack/virt/inject-trust-anchor.yaml \ -e /home/stack/virt/public_vip.yaml \ -e /usr/share/openstack-tripleo-heat-templates/environments/tls-endpoints-public-ip.yaml \ -e /home/stack/virt/hostnames.yml \ -e /home/stack/virt/debug.yaml \ -e /home/stack/virt/nodes_data.yaml \ -e /usr/share/openstack-tripleo-heat-templates/environments/major-upgrade-composable-steps-docker.yaml \ -e /home/stack/ceph-ansible-env.yaml \ -e /home/stack/docker-osp12.yaml ... 2018-07-19 10:14:43Z [overcloud-AllNodesDeploySteps-xlgc5gnq7vqj.AllNodesPostUpgradeSteps.CephStorageDeployment_Step5]: CREATE_COMPLETE state changed 2018-07-19 10:16:12Z [overcloud-AllNodesDeploySteps-xlgc5gnq7vqj.AllNodesPostUpgradeSteps.ControllerDeployment_Step5]: CREATE_FAILED Error: resources.ControllerDeployment_Step5.resources[0]: Deployment to server failed: deploy_status_code: Deployment exited with non-zero status code: 2 2018-07-19 10:16:12Z [overcloud-AllNodesDeploySteps-xlgc5gnq7vqj.AllNodesPostUpgradeSteps]: CREATE_FAILED Resource CREATE failed: Error: resources.ControllerDeployment_Step5.resources[0]: Deployment to server failed: deploy_status_code: Deployment exited with non-zero status code: 2 2018-07-19 10:16:12Z [overcloud-AllNodesDeploySteps-xlgc5gnq7vqj.AllNodesPostUpgradeSteps]: CREATE_FAILED Error: resources.AllNodesPostUpgradeSteps.resources.ControllerDeployment_Step5.resources[0]: Deployment to server failed: deploy_status_code: Deployment exited with non-zero status code: 2 2018-07-19 10:16:12Z [overcloud-AllNodesDeploySteps-xlgc5gnq7vqj]: UPDATE_FAILED Error: resources.AllNodesPostUpgradeSteps.resources.ControllerDeployment_Step5.resources[0]: Deployment to server failed: deploy_status_code: Deployment exited with non-zero status code: 2 2018-07-19 10:16:13Z [AllNodesDeploySteps]: UPDATE_FAILED resources.AllNodesDeploySteps: Error: resources.AllNodesPostUpgradeSteps.resources.ControllerDeployment_Step5.resources[0]: Deployment to server failed: deploy_status_code: Deployment exited with non-zero status code: 2 2018-07-19 10:16:14Z [overcloud]: UPDATE_FAILED resources.AllNodesDeploySteps: Error: resources.AllNodesPostUpgradeSteps.resources.ControllerDeployment_Step5.resources[0]: Deployment to server failed: deploy_status_code: Deployment exited with non-zero status code: 2 Stack overcloud UPDATE_FAILED overcloud.AllNodesDeploySteps.AllNodesPostUpgradeSteps.ControllerDeployment_Step5.1: resource_type: OS::Heat::StructuredDeployment physical_resource_id: 752803a0-ac99-4e35-85c5-73005ee5f239 status: CREATE_FAILED status_reason: | CREATE aborted deploy_stdHeat Stack update failed. Heat Stack update failed. out: | None deploy_stderr: | None overcloud.AllNodesDeploySteps.AllNodesPostUpgradeSteps.ControllerDeployment_Step5.0: resource_type: OS::Heat::StructuredDeployment physical_resource_id: 74caef15-dc2c-41a7-b706-0db5015ef64c status: CREATE_FAILED status_reason: | Error: resources[0]: Deployment to server failed: deploy_status_code : Deployment exited with non-zero status code: 2 deploy_stdout: | ... " ...", "nova-manage: error: unrecognized arguments: --by-service", "stdout: " ] } to retry, use: --limit @/var/lib/heat-config/heat-config-ansible/17f6ad3e-9f0e-4f6f-ac90-181a2a9c998f_playbook.retry PLAY RECAP ********************************************************************* localhost : ok=7 changed=2 unreachable=0 failed=1 (truncated, view all with --long) Version-Release number of selected component (if applicable): ------------------------------------------------------------- openstack-tripleo-heat-templates-7.0.12-3.el7ost.noarch openstack-nova-api.noarch 1:16.1.4-4.el7ost openstack-nova-common.noarch 1:16.1.4-4.el7ost openstack-nova-compute.noarch 1:16.1.4-4.el7ost openstack-nova-conductor.noarch 1:16.1.4-4.el7ost openstack-nova-console.noarch 1:16.1.4-4.el7ost openstack-nova-migration.noarch 1:16.1.4-4.el7ost openstack-nova-novncproxy.noarch 1:16.1.4-4.el7ost openstack-nova-placement-api.noarch 1:16.1.4-4.el7ost openstack-nova-scheduler.noarch 1:16.1.4-4.el7ost Steps to Reproduce: ------------------- 1. Follow upgrade procedure for RHOS-11 upgrade