Description of problem:
The Tempest test, test_connectivity_between_vms_on_different_networks
is failing on our D/S CI gate:
Traceback (most recent call last):
File "/usr/lib/python2.7/site-packages/tempest/common/utils/__init__.py", line 89, in wrapper
return f(*func_args, **func_kwargs)
File "/usr/lib/python2.7/site-packages/tempest/scenario/test_network_basic_ops.py", line 490, in test_connectivity_between_vms_on_different_networks
should_connect=True)
File "/usr/lib/python2.7/site-packages/tempest/scenario/test_network_basic_ops.py", line 329, in _check_network_internal_connectivity
should_connect)
File "/usr/lib/python2.7/site-packages/tempest/scenario/test_network_basic_ops.py", line 363, in _check_server_connectivity
should_connect)
File "/usr/lib/python2.7/site-packages/tempest/scenario/manager.py", line 960, in check_remote_connectivity
self.fail(msg)
File "/usr/lib/python2.7/site-packages/unittest2/case.py", line 666, in fail
raise self.failureException(msg)
AssertionError: Timed out waiting for 10.100.0.18 to become reachable from 10.0.0.216
Version-Release number of selected component (if applicable):
osp14 2018-10-08.4
How reproducible:
100%
Steps to Reproduce:
1. run CI jobs
2.
3.
Actual results:
all tests should pass
Expected results:
the test failed
Additional info:
Since the problem described in this bug report should be
resolved in a recent advisory, it has been closed with a
resolution of ERRATA.
For information on the advisory, and where to find the updated
files, follow the link below.
If the solution does not work for you, open a new bug report.
https://access.redhat.com/errata/RHBA-2019:1671
Description of problem: The Tempest test, test_connectivity_between_vms_on_different_networks is failing on our D/S CI gate: Traceback (most recent call last): File "/usr/lib/python2.7/site-packages/tempest/common/utils/__init__.py", line 89, in wrapper return f(*func_args, **func_kwargs) File "/usr/lib/python2.7/site-packages/tempest/scenario/test_network_basic_ops.py", line 490, in test_connectivity_between_vms_on_different_networks should_connect=True) File "/usr/lib/python2.7/site-packages/tempest/scenario/test_network_basic_ops.py", line 329, in _check_network_internal_connectivity should_connect) File "/usr/lib/python2.7/site-packages/tempest/scenario/test_network_basic_ops.py", line 363, in _check_server_connectivity should_connect) File "/usr/lib/python2.7/site-packages/tempest/scenario/manager.py", line 960, in check_remote_connectivity self.fail(msg) File "/usr/lib/python2.7/site-packages/unittest2/case.py", line 666, in fail raise self.failureException(msg) AssertionError: Timed out waiting for 10.100.0.18 to become reachable from 10.0.0.216 Version-Release number of selected component (if applicable): osp14 2018-10-08.4 How reproducible: 100% Steps to Reproduce: 1. run CI jobs 2. 3. Actual results: all tests should pass Expected results: the test failed Additional info: