Bug 1903954 - mopidy fails to build with Python 3.10: FAIL: test_invalid_params_causes_invalid_params_error
Summary: mopidy fails to build with Python 3.10: FAIL: test_invalid_params_causes_inva...
Keywords:
Status: CLOSED RAWHIDE
Alias: None
Product: Fedora
Classification: Fedora
Component: mopidy
Version: rawhide
Hardware: Unspecified
OS: Unspecified
unspecified
unspecified
Target Milestone: ---
Assignee: Tobias
QA Contact: Fedora Extras Quality Assurance
URL:
Whiteboard:
Depends On:
Blocks: PYTHON3.10
TreeView+ depends on / blocked
 
Reported: 2020-12-03 08:42 UTC by Tomáš Hrnčiar
Modified: 2020-12-03 18:21 UTC (History)
3 users (show)

Fixed In Version:
Doc Type: If docs needed, set a value
Doc Text:
Clone Of:
Environment:
Last Closed: 2020-12-03 18:21:00 UTC
Type: Bug


Attachments (Terms of Use)

Description Tomáš Hrnčiar 2020-12-03 08:42:17 UTC
mopidy fails to build with Python 3.10.0a2.

======================================================================
FAIL: test_invalid_params_causes_invalid_params_error (tests.internal.test_jsonrpc.JsonRpcSingleCommandErrorTest)
----------------------------------------------------------------------
Traceback (most recent call last):
  File "/builddir/build/BUILD/Mopidy-3.0.2/tests/internal/test_jsonrpc.py", line 494, in test_invalid_params_causes_invalid_params_error
    assert (
AssertionError

----------------------------------------------------------------------
Ran 667 tests in 2.854s

FAILED (failures=1)
Test failed: <unittest.runner.TextTestResult run=667 errors=0 failures=1>
error: Test failed: <unittest.runner.TextTestResult run=667 errors=0 failures=1>
error: Bad exit status from /var/tmp/rpm-tmp.kjPKyu (%check)
    Bad exit status from /var/tmp/rpm-tmp.kjPKyu (%check)


For the build logs, see:
https://copr-be.cloud.fedoraproject.org/results/@python/python3.10/fedora-rawhide-x86_64/01809448-mopidy/

For all our attempts to build mopidy with Python 3.10, see:
https://copr.fedorainfracloud.org/coprs/g/python/python3.10/package/mopidy/

Testing and mass rebuild of packages is happening in copr. You can follow these instructions to test locally in mock if your package builds with Python 3.10:
https://copr.fedorainfracloud.org/coprs/g/python/python3.10/

Let us know here if you have any questions.

Python 3.10 will be included in Fedora 35. To make that update smoother, we're building Fedora packages with early pre-releases of Python 3.10.
A build failure prevents us from testing all dependent packages (transitive [Build]Requires), so if this package is required a lot, it's important for us to get it fixed soon.
We'd appreciate help from the people who know this package best, but if you don't want to work on this now, let us know so we can try to work around it on our side.

Comment 1 Tobias 2020-12-03 18:21:00 UTC
Patch applied locally and submitted upstream. Thanks.


Note You need to log in before you can comment on or make changes to this bug.