Bug 1911493
| Summary: | kvdo module missing 4.18.0-259 | ||
|---|---|---|---|
| Product: | Red Hat Enterprise Linux 8 | Reporter: | penguinpages <jeremey.wise> |
| Component: | kmod-kvdo | Assignee: | vdo-internal <vdo-internal> |
| Status: | CLOSED DUPLICATE | QA Contact: | vdo-qe |
| Severity: | high | Docs Contact: | |
| Priority: | unspecified | ||
| Version: | CentOS Stream | CC: | awalsh, bstinson, carl, cwei, emcnabb, jwboyer |
| Target Milestone: | rc | Flags: | pm-rhel:
mirror+
|
| Target Release: | 8.0 | ||
| Hardware: | x86_64 | ||
| OS: | Linux | ||
| Whiteboard: | |||
| Fixed In Version: | Doc Type: | If docs needed, set a value | |
| Doc Text: | Story Points: | --- | |
| Clone Of: | Environment: | ||
| Last Closed: | 2021-01-04 19:51:38 UTC | Type: | Bug |
| Regression: | --- | Mount Type: | --- |
| Documentation: | --- | CRM: | |
| Verified Versions: | Category: | --- | |
| oVirt Team: | --- | RHEL 7.3 requirements from Atomic Host: | |
| Cloudforms Team: | --- | Target Upstream Version: | |
| Embargoed: | |||
|
Description
penguinpages
2020-12-29 19:01:12 UTC
Update: I tried to download and compile but running into error on "uuid.h" #### # Download compiler packages yum install gcc uuidd -y wget https://zlib.net/zlib-1.2.11.tar.gz tar -zxvf zlib-1.2.11.tar.gz cd zlib-1.2.11/ ./configure make [root@medusa vdo]# make for d in examples utils vdo-manager; do \ make -C $d all || exit 1; \ done make[1]: Entering directory '/root/vdo_packages/vdo/examples' for d in ansible monitor systemd udev; do \ make -C $d all || exit 1; \ done make[2]: Entering directory '/root/vdo_packages/vdo/examples/ansible' make[2]: Nothing to be done for 'all'. make[2]: Leaving directory '/root/vdo_packages/vdo/examples/ansible' make[2]: Entering directory '/root/vdo_packages/vdo/examples/monitor' make[2]: Nothing to be done for 'all'. make[2]: Leaving directory '/root/vdo_packages/vdo/examples/monitor' make[2]: Entering directory '/root/vdo_packages/vdo/examples/systemd' make[2]: Nothing to be done for 'all'. make[2]: Leaving directory '/root/vdo_packages/vdo/examples/systemd' make[2]: Entering directory '/root/vdo_packages/vdo/examples/udev' make[2]: Nothing to be done for 'all'. make[2]: Leaving directory '/root/vdo_packages/vdo/examples/udev' make[1]: Leaving directory '/root/vdo_packages/vdo/examples' make[1]: Entering directory '/root/vdo_packages/vdo/utils' for d in uds vdo; do \ make -C $d all || exit 1; \ done make[2]: Entering directory '/root/vdo_packages/vdo/utils/uds' make[2]: lsb_release: Command not found gcc -fpic -D_GNU_SOURCE -g -O3 -fno-omit-frame-pointer -Wall -Wcast-align -Werror -Wextra -Winit-self -Wlogical-op -Wmissing-include-dirs -Wpointer-arith -Wredundant-decls -Wunused -Wwrite-strings -DUDS_VERSION='"8.0.2.2"' -I. -std=c99 -Wbad-function-cast -Wcast-qual -Wfloat-equal -Wformat=2 -Wmissing-declarations -Wmissing-format-attribute -Wmissing-prototypes -Wnested-externs -Wold-style-definition -Wswitch-default -pedantic -MM -MF .deps/zone.d -MP -MT zone.o zone.c gcc -fpic -D_GNU_SOURCE -g -O3 -fno-omit-frame-pointer -Wall -Wcast-align -Werror -Wextra -Winit-self -Wlogical-op -Wmissing-include-dirs -Wpointer-arith -Wredundant-decls -Wunused -Wwrite-strings -DUDS_VERSION='"8.0.2.2"' -I. -std=c99 -Wbad-function-cast -Wcast-qual -Wfloat-equal -Wformat=2 -Wmissing-declarations -Wmissing-format-attribute -Wmissing-prototypes -Wnested-externs -Wold-style-definition -Wswitch-default -pedantic -MM -MF .deps/volumeStore.d -MP -MT volumeStore.o volumeStore.c gcc -fpic -D_GNU_SOURCE -g -O3 -fno-omit-frame-pointer -Wall -Wcast-align -Werror -Wextra -Winit-self -Wlogical-op -Wmissing-include-dirs -Wpointer-arith -Wredundant-decls -Wunused -Wwrite-strings -DUDS_VERSION='"8.0.2.2"' -I. -std=c99 -Wbad-function-cast -Wcast-qual -Wfloat-equal -Wformat=2 -Wmissing-declarations -Wmissing-format-attribute -Wmissing-prototypes -Wnested-externs -Wold-style-definition -Wswitch-default -pedantic -MM -MF .deps/volume.d -MP -MT volume.o volume.c <snip> fi cc -fPIC -fpic -D_GNU_SOURCE -g -O3 -fno-omit-frame-pointer -Wall -Wcast-align -Werror -Wextra -Winit-self -Wlogical-op -Wmissing-include-dirs -Wpointer-arith -Wredundant-decls -Wunused -Wwrite-strings -std=c99 -Wbad-function-cast -Wcast-qual -Wfloat-equal -Wformat=2 -Wmissing-declarations -Wmissing-format-attribute -Wmissing-prototypes -Wnested-externs -Wold-style-definition -Wswitch-default -pedantic -I../base -I../../uds -Wno-write-strings -DINTERNAL -DCURRENT_VERSION="\"6.2.4.14\"" -c -MMD -MF .deps/parseUtils.d.new -MP -MT parseUtils.o -o parseUtils.o parseUtils.c if cmp -s .deps/parseUtils.d .deps/parseUtils.d.new ; \ then \ rm -f .deps/parseUtils.d.new ; \ else \ mv -f .deps/parseUtils.d.new .deps/parseUtils.d ; \ fi cc -fPIC -fpic -D_GNU_SOURCE -g -O3 -fno-omit-frame-pointer -Wall -Wcast-align -Werror -Wextra -Winit-self -Wlogical-op -Wmissing-include-dirs -Wpointer-arith -Wredundant-decls -Wunused -Wwrite-strings -std=c99 -Wbad-function-cast -Wcast-qual -Wfloat-equal -Wformat=2 -Wmissing-declarations -Wmissing-format-attribute -Wmissing-prototypes -Wnested-externs -Wold-style-definition -Wswitch-default -pedantic -I../base -I../../uds -Wno-write-strings -DINTERNAL -DCURRENT_VERSION="\"6.2.4.14\"" -c -MMD -MF .deps/vdoConfig.d.new -MP -MT vdoConfig.o -o vdoConfig.o vdoConfig.c vdoConfig.c:22:10: fatal error: uuid/uuid.h: No such file or directory #include <uuid/uuid.h> ^~~~~~~~~~~~~ compilation terminated. make[3]: *** [Makefile:134: vdoConfig.o] Error 1 make[3]: Leaving directory '/root/vdo_packages/vdo/utils/vdo/user' make[2]: *** [Makefile:25: all] Error 1 make[2]: Leaving directory '/root/vdo_packages/vdo/utils/vdo' make[1]: *** [Makefile:26: all] Error 1 make[1]: Leaving directory '/root/vdo_packages/vdo/utils' make: *** [Makefile:31: all] Error 1 [root@medusa vdo]# Thanks for the report. This is already reported via bz1907968. (In reply to penguinpages from comment #1) > Update: I tried to download and compile but running into error on "uuid.h" For this, you need to make sure you have libuuid-devel installed. That should resolve the error looking for uuid.h. *** This bug has been marked as a duplicate of bug 1907968 *** |