Bug 1914318 - scons fails to build with Python 3.10: AssertionError: did not catch expected InternalError exception
Summary: scons fails to build with Python 3.10: AssertionError: did not catch expected...
Keywords:
Status: CLOSED RAWHIDE
Alias: None
Product: Fedora
Classification: Fedora
Component: scons
Version: rawhide
Hardware: Unspecified
OS: Unspecified
unspecified
unspecified
Target Milestone: ---
Assignee: Antonio T. sagitter
QA Contact: Fedora Extras Quality Assurance
URL:
Whiteboard:
Depends On:
Blocks: PYTHON3.10
TreeView+ depends on / blocked
 
Reported: 2021-01-08 15:21 UTC by Miro Hrončok
Modified: 2021-01-13 11:48 UTC (History)
8 users (show)

Fixed In Version:
Doc Type: If docs needed, set a value
Doc Text:
Clone Of:
Environment:
Last Closed: 2021-01-13 11:35:00 UTC
Type: Bug


Attachments (Terms of Use)


Links
System ID Private Priority Status Summary Last Updated
Github SCons scons issues 3860 0 None closed [test__nonzero__] Failed test by using Python-3.10.0a4 2021-01-13 11:34:19 UTC

Description Miro Hrončok 2021-01-08 15:21:41 UTC
scons fails to build with Python 3.10.0a4.

+ /usr/bin/python3 runtest.py -P /usr/bin/python3 --passed --quit-on-failure SCons/BuilderTests.py
1/1 (100.00%) /usr/bin/python3 SCons/BuilderTests.py
....F.................................
======================================================================
FAIL: test__nonzero__ (__main__.BuilderTestCase)
Test a builder raising an exception when __nonzero__ is called
----------------------------------------------------------------------
Traceback (most recent call last):
  File "/builddir/build/BUILD/scons-4.0.1/SCons/BuilderTests.py", line 233, in test__nonzero__
    assert exc_caught, "did not catch expected InternalError exception"
AssertionError: did not catch expected InternalError exception

----------------------------------------------------------------------
Ran 38 tests in 0.092s

FAILED (failures=1)

For the build logs, see:
https://copr-be.cloud.fedoraproject.org/results/@python/python3.10/fedora-rawhide-x86_64/01865304-scons/

For all our attempts to build scons with Python 3.10, see:
https://copr.fedorainfracloud.org/coprs/g/python/python3.10/package/scons/

Testing and mass rebuild of packages is happening in copr. You can follow these instructions to test locally in mock if your package builds with Python 3.10:
https://copr.fedorainfracloud.org/coprs/g/python/python3.10/

Let us know here if you have any questions.

Python 3.10 will be included in Fedora 35. To make that update smoother, we're building Fedora packages with early pre-releases of Python 3.10.
A build failure prevents us from testing all dependent packages (transitive [Build]Requires), so if this package is required a lot, it's important for us to get it fixed soon.
We'd appreciate help from the people who know this package best, but if you don't want to work on this now, let us know so we can try to work around it on our side.

Comment 1 Antonio T. sagitter 2021-01-13 11:35:00 UTC
Fixed on Rawhide

Comment 2 Miro Hrončok 2021-01-13 11:48:09 UTC
Thank You!


Note You need to log in before you can comment on or make changes to this bug.