Note: This bug is displayed in read-only format because
the product is no longer active in Red Hat Bugzilla.
RHEL Engineering is moving the tracking of its product development work on RHEL 6 through RHEL 9 to Red Hat Jira (issues.redhat.com). If you're a Red Hat customer, please continue to file support cases via the Red Hat customer portal. If you're not, please head to the "RHEL project" in Red Hat Jira and file new tickets here. Individual Bugzilla bugs in the statuses "NEW", "ASSIGNED", and "POST" are being migrated throughout September 2023. Bugs of Red Hat partners with an assigned Engineering Partner Manager (EPM) are migrated in late September as per pre-agreed dates. Bugs against components "kernel", "kernel-rt", and "kpatch" are only migrated if still in "NEW" or "ASSIGNED". If you cannot log in to RH Jira, please consult article #7032570. That failing, please send an e-mail to the RH Jira admins at rh-issues@redhat.com to troubleshoot your issue as a user management inquiry. The email creates a ServiceNow ticket with Red Hat. Individual Bugzilla bugs that are migrated will be moved to status "CLOSED", resolution "MIGRATED", and set with "MigratedToJIRA" in "Keywords". The link to the successor Jira issue will be found under "Links", have a little "two-footprint" icon next to it, and direct you to the "RHEL project" in Red Hat Jira (issue links are of type "https://issues.redhat.com/browse/RHEL-XXXX", where "X" is a digit). This same link will be available in a blue banner at the top of the page informing you that that bug has been migrated.
DescriptionBruno Meneguele
2021-06-28 14:14:58 UTC
Description of problem:
kernel-4.18.0-318.el8 revdep OSCI test failed due to what seems to be a NetworkManager sanity-test suite failure. Not sure if that's in the NetworkManager code itself or on its test suite.
How reproducible:
Seen in one kernel reverse dependency test so far.
Actual results:
Feature: nmcli - ethernet
Executing @8021x
* waiting for testeth0 to connect
** we do have IPv4 complete
NetworkManager process id before: 31915
before_scenario ... failed in 8.121s
Traceback (most recent call last):
File "features/environment.py", line 51, in before_scenario
_before_scenario(context, scenario)
File "features/environment.py", line 139, in _before_scenario
assert False, "Exception in before scenario tags"
AssertionError: Exception in before scenario tags
HOOK-ERROR in before_scenario: AssertionError: Exception in before scenario tags
Scenario: nmcli - ethernet - connect to 8021x -ttls - mschap - eap
NetworkManager process id after: 31915 (was 31915)
Executing @attach_wpa_supplicant_log
Attaching wpa_supplicant log
Executing @attach_hostapd_log
Attaching hostapd log
Executing @8021x
* waiting for testeth0 to connect
** we do have IPv4 complete
Executing @con_ethernet_remove
Attaching NM log
after_scenario ... passed in 0.702s
ALL DONE
Failing scenarios:
features/scenarios/ethernet.feature:518 nmcli - ethernet - connect to 8021x -ttls - mschap - eap
Expected results:
No test failures
Additional info:
OSCI artifact: https://dashboard.osci.redhat.com/#/artifact/brew-build/aid/37735998?focus=id:osci-rhel-pipeline-integration-37735998
NetworkManager sanity-test log: http://artifacts.osci.redhat.com/rhel-8.5.0-packages/rhel-revdep-pipeline/kernel/37735998/package-tests/NetworkManager/logs/FAIL-str_sanity-tests.log
The hook-error points to a mistake in our tests and not in the NetworkManager but Filip will know better. I am setting Filip to as QA Contact. He will be back tomorrow to investigate.
The mentioned error is because setup of the test failed (HOOK-ERROR means error before or after the actual test, in this case before). I think this might be related to openssl version increase, which removes MD4 cipher and so our setup for 8021x tests fails. We did not manage to fix the testsuite yet.
Here is the tracker for rhel9, https://bugzilla.redhat.com/show_bug.cgi?id=1975718 . I do not know if we have tracker for rhel8, I will check tomorrow.
(In reply to Filip Pokryvka from comment #2)
> The mentioned error is because setup of the test failed (HOOK-ERROR means
> error before or after the actual test, in this case before). I think this
> might be related to openssl version increase, which removes MD4 cipher and
> so our setup for 8021x tests fails. We did not manage to fix the testsuite
> yet.
if it is a bug in the testsuite, please close it or assign it to you if you need it for tracking. Thanks.
Description of problem: kernel-4.18.0-318.el8 revdep OSCI test failed due to what seems to be a NetworkManager sanity-test suite failure. Not sure if that's in the NetworkManager code itself or on its test suite. How reproducible: Seen in one kernel reverse dependency test so far. Actual results: Feature: nmcli - ethernet Executing @8021x * waiting for testeth0 to connect ** we do have IPv4 complete NetworkManager process id before: 31915 before_scenario ... failed in 8.121s Traceback (most recent call last): File "features/environment.py", line 51, in before_scenario _before_scenario(context, scenario) File "features/environment.py", line 139, in _before_scenario assert False, "Exception in before scenario tags" AssertionError: Exception in before scenario tags HOOK-ERROR in before_scenario: AssertionError: Exception in before scenario tags Scenario: nmcli - ethernet - connect to 8021x -ttls - mschap - eap NetworkManager process id after: 31915 (was 31915) Executing @attach_wpa_supplicant_log Attaching wpa_supplicant log Executing @attach_hostapd_log Attaching hostapd log Executing @8021x * waiting for testeth0 to connect ** we do have IPv4 complete Executing @con_ethernet_remove Attaching NM log after_scenario ... passed in 0.702s ALL DONE Failing scenarios: features/scenarios/ethernet.feature:518 nmcli - ethernet - connect to 8021x -ttls - mschap - eap Expected results: No test failures Additional info: OSCI artifact: https://dashboard.osci.redhat.com/#/artifact/brew-build/aid/37735998?focus=id:osci-rhel-pipeline-integration-37735998 NetworkManager sanity-test log: http://artifacts.osci.redhat.com/rhel-8.5.0-packages/rhel-revdep-pipeline/kernel/37735998/package-tests/NetworkManager/logs/FAIL-str_sanity-tests.log