Bug 225307 - Merge Review: awesfx
Merge Review: awesfx
Status: CLOSED NOTABUG
Product: Fedora
Classification: Fedora
Component: Package Review (Show other bugs)
rawhide
All Linux
medium Severity medium
: ---
: ---
Assigned To: Jon Ciesla
Fedora Package Reviews List
:
Depends On:
Blocks:
  Show dependency treegraph
 
Reported: 2007-01-29 16:09 EST by Nobody's working on this, feel free to take it
Modified: 2009-09-26 10:06 EDT (History)
1 user (show)

See Also:
Fixed In Version:
Doc Type: Bug Fix
Doc Text:
Story Points: ---
Clone Of:
Environment:
Last Closed: 2008-05-19 03:44:18 EDT
Type: ---
Regression: ---
Mount Type: ---
Documentation: ---
CRM:
Verified Versions:
Category: ---
oVirt Team: ---
RHEL 7.3 requirements from Atomic Host:
Cloudforms Team: ---


Attachments (Terms of Use)

  None (edit)
Description Nobody's working on this, feel free to take it 2007-01-29 16:09:43 EST
Fedora Merge Review: awesfx

http://cvs.fedora.redhat.com/viewcvs/devel/awesfx/
Comment 1 Jon Ciesla 2008-02-05 15:22:25 EST
Local build fails:

+ make
Making all in awelib
make[1]: Entering directory `/var/storage/redhat/BUILD/awesfx-0.5.0d/awelib'
if gcc -DHAVE_CONFIG_H -I. -I. -I../include -I../include    -O2 -g -pipe -Wall
-Wp,-D_FORTIFY_SOURCE=2 -fexceptions -fstack-protector --param=ssp-buffer-size=4
-m32 -march=i386 -mtune=generic -fasynchronous-unwind-tables -MT awe_parm.o -MD
-MP -MF ".deps/awe_parm.Tpo" -c -o awe_parm.o awe_parm.c; \
        then mv -f ".deps/awe_parm.Tpo" ".deps/awe_parm.Po"; else rm -f
".deps/awe_parm.Tpo"; exit 1; fi
In file included from awe_parm.c:25:
../include/awe_parm.h:25:29: error: linux/awe_voice.h: No such file or directory
In file included from awe_parm.c:25:
../include/awe_parm.h:30: error: expected ')' before '*' token
../include/awe_parm.h:31: error: expected ')' before '*' token
awe_parm.c:109: error: expected ')' before '*' token
awe_parm.c:142: error: expected ')' before '*' token
make[1]: *** [awe_parm.o] Error 1
make[1]: Leaving directory `/var/storage/redhat/BUILD/awesfx-0.5.0d/awelib'
make: *** [all-recursive] Error 1
error: Bad exit status from /var/tmp/rpm-tmp.94791 (%build)
Comment 2 Jon Ciesla 2008-05-16 11:10:40 EDT
Still fails. . .failed gcc43 autorebuild too. . .
Comment 3 Martin Stransky 2008-05-19 03:44:18 EDT
awesfx has been removed from distro.
Comment 4 Peter Lemenkov 2009-09-26 10:06:50 EDT
awesfx was returned to FEDORA, but this ticket has nothing with this new awesfx. I'm changing status to NOTABUG

Note You need to log in before you can comment on or make changes to this bug.