Fedora Account System
Red Hat Associate
Red Hat Customer
The Chromium build breaks with errors in fedora 44: FAILED: [code=1] transport_security_state_generator "/usr/bin/python3" "../../build/toolchain/gcc_link_wrapper.py" --output="./transport_security_state_generator" -- clang++ -fuse-ld=lld -Wl,--fatal-warnings -Wl,--build-id=sha1 -fPIC -Wl,-z,noexecstack -Wl,-z,relro -Wl,-z,now -Wl,--icf=all -Wl,--color-diagnostics -Wl,--undefined-version -Wl,--no-call-graph-profile-sort --target=x86_64-unknown-linux-gnu -no-canonical-prefixes -Wl,-O2 -Wl,--gc-sections -Wl,-z,defs -Wl,--as-needed -nostdlib++ -rdynamic -pie -Wl,--disable-new-dtags prebuilt_rustc_sysroot/lib/rustlib/x86_64-unknown-linux-gnu/lib/libstd.rlib prebuilt_rustc_sysroot/lib/rustlib/x86_64-unknown-linux-gnu/lib/liballoc.rlib prebuilt_rustc_sysroot/lib/rustlib/x86_64-unknown-linux-gnu/lib/libcfg_if.rlib prebuilt_rustc_sysroot/lib/rustlib/x86_64-unknown-linux-gnu/lib/libcompiler_builtins.rlib prebuilt_rustc_sysroot/lib/rustlib/x86_64-unknown-linux-gnu/lib/libcore.rlib prebuilt_rustc_sysroot/lib/rustlib/x86_64-unknown-linux-gnu/lib/libgetopts.rlib prebuilt_rustc_sysroot/lib/rustlib/x86_64-unknown-linux-gnu/lib/libhashbrown.rlib prebuilt_rustc_sysroot/lib/rustlib/x86_64-unknown-linux-gnu/lib/libpanic_abort.rlib prebuilt_rustc_sysroot/lib/rustlib/x86_64-unknown-linux-gnu/lib/libpanic_unwind.rlib prebuilt_rustc_sysroot/lib/rustlib/x86_64-unknown-linux-gnu/lib/librustc_demangle.rlib prebuilt_rustc_sysroot/lib/rustlib/x86_64-unknown-linux-gnu/lib/libstd_detect.rlib prebuilt_rustc_sysroot/lib/rustlib/x86_64-unknown-linux-gnu/lib/libtest.rlib prebuilt_rustc_sysroot/lib/rustlib/x86_64-unknown-linux-gnu/lib/libunicode_width.rlib prebuilt_rustc_sysroot/lib/rustlib/x86_64-unknown-linux-gnu/lib/libunwind.rlib prebuilt_rustc_sysroot/lib/rustlib/x86_64-unknown-linux-gnu/lib/libaddr2line.rlib prebuilt_rustc_sysroot/lib/rustlib/x86_64-unknown-linux-gnu/lib/libadler2.rlib prebuilt_rustc_sysroot/lib/rustlib/x86_64-unknown-linux-gnu/lib/libgimli.rlib prebuilt_rustc_sysroot/lib/rustlib/x86_64-unknown-linux-gnu/lib/liblibc.rlib prebuilt_rustc_sysroot/lib/rustlib/x86_64-unknown-linux-gnu/lib/libmemchr.rlib prebuilt_rustc_sysroot/lib/rustlib/x86_64-unknown-linux-gnu/lib/libminiz_oxide.rlib prebuilt_rustc_sysroot/lib/rustlib/x86_64-unknown-linux-gnu/lib/libobject.rlib -Wl,-z,relro -Wl,--as-needed -Wl,-z,pack-relative-relocs -Wl,-z,now -specs=/usr/lib/rpm/redhat/redhat-hardened-ld -specs=/usr/lib/rpm/redhat/redhat-hardened-ld-errors -specs=/usr/lib/rpm/redhat/redhat-annobin-cc1 -Wl,--build-id=sha1 -specs=/usr/lib/rpm/redhat/redhat-package-notes -o "./transport_security_state_generator" -Wl,--start-group @"./transport_security_state_generator.rsp" -Wl,--end-group /usr/lib/clang/21/lib/x86_64-redhat-linux-gnu/libclang_rt.builtins.a -ldl -lpthread -lrt -lglib-2.0 -lgmodule-2.0 -lgobject-2.0 -lgthread-2.0 -latomic -ldouble-conversion -lnspr4 -lnss3 -lnssutil3 -lplc4 -lplds4 -lsmime3 -Wl,--start-group obj/third_party/rust/cxx/v1/lib/libcxx_lib.rlib obj/third_party/rust/foldhash/v0_1/lib/libfoldhash_lib.rlib obj/build/rust/allocator/libbuild_srust_sallocator_callocator.rlib obj/build/rust/allocator/liballoc_error_handler_impl_ffi.rlib obj/build/rust/allocator/liballocator_impls_ffi.rlib obj/base/libbase_crust_ulogger.rlib obj/base/libbase_clogging_ulog_useverity_ubindgen.rlib obj/third_party/rust/log/v0_4/lib/liblog_lib.rlib obj/build/rust/chromium_prelude/libchromium.rlib obj/third_party/rust/serde_json_lenient/v0_2/wrapper/libthird_uparty_srust_sserde_ujson_ulenient_sv0_u2_swrapper_cwrapper.rlib obj/third_party/rust/serde/v1/lib/libserde_lib.rlib obj/third_party/rust/serde_json_lenient/v0_2/lib/libserde_json_lenient_lib.rlib obj/third_party/rust/itoa/v1/lib/libitoa_lib.rlib obj/third_party/rust/memchr/v2/lib/libmemchr_lib.rlib obj/third_party/rust/ryu/v1/lib/libryu_lib.rlib -Wl,--end-group clang++: warning: argument unused during compilation: '-specs=/usr/lib/rpm/redhat/redhat-hardened-ld' [-Wunused-command-line-argument] clang++: warning: argument unused during compilation: '-specs=/usr/lib/rpm/redhat/redhat-hardened-ld-errors' [-Wunused-command-line-argument] clang++: warning: argument unused during compilation: '-specs=/usr/lib/rpm/redhat/redhat-annobin-cc1' [-Wunused-command-line-argument] clang++: warning: argument unused during compilation: '-specs=/usr/lib/rpm/redhat/redhat-package-notes' [-Wunused-command-line-argument] ld.lld: error: undefined symbol: __rustc::__rust_alloc_error_handler_should_panic_v2 >>> referenced by alloc.rs:435 (library/alloc/src/alloc.rs:435) >>> alloc-89c079dc503872cc.alloc.6e7db227d0aa2641-cgu.0.rcgu.o:(__rustc::__rdl_oom) in archive prebuilt_rustc_sysroot/lib/rustlib/x86_64-unknown-linux-gnu/lib/liballoc.rlib >>> referenced by alloc.rs:355 (library/std/src/alloc.rs:355) >>> std-b50617b29e31fd0b.std.2a1a0cc949c77e59-cgu.0.rcgu.o:(std::alloc::default_alloc_error_hook::heae949e1e5961fe0) in archive prebuilt_rustc_sysroot/lib/rustlib/x86_64-unknown-linux-gnu/lib/libstd.rlib Reproducible: Always Steps to Reproduce: Build latest chromium in F44 which includes rust-1.90 Actual Results: The build failed with following errors: FAILED: [code=1] transport_security_state_generator "/usr/bin/python3" "../../build/toolchain/gcc_link_wrapper.py" --output="./transport_security_state_generator" -- clang++ -fuse-ld=lld -Wl,--fatal-warnings -Wl,--build-id=sha1 -fPIC -Wl,-z,noexecstack -Wl,-z,relro -Wl,-z,now -Wl,--icf=all -Wl,--color-diagnostics -Wl,--undefined-version -Wl,--no-call-graph-profile-sort --target=x86_64-unknown-linux-gnu -no-canonical-prefixes -Wl,-O2 -Wl,--gc-sections -Wl,-z,defs -Wl,--as-needed -nostdlib++ -rdynamic -pie -Wl,--disable-new-dtags prebuilt_rustc_sysroot/lib/rustlib/x86_64-unknown-linux-gnu/lib/libstd.rlib prebuilt_rustc_sysroot/lib/rustlib/x86_64-unknown-linux-gnu/lib/liballoc.rlib prebuilt_rustc_sysroot/lib/rustlib/x86_64-unknown-linux-gnu/lib/libcfg_if.rlib prebuilt_rustc_sysroot/lib/rustlib/x86_64-unknown-linux-gnu/lib/libcompiler_builtins.rlib prebuilt_rustc_sysroot/lib/rustlib/x86_64-unknown-linux-gnu/lib/libcore.rlib prebuilt_rustc_sysroot/lib/rustlib/x86_64-unknown-linux-gnu/lib/libgetopts.rlib prebuilt_rustc_sysroot/lib/rustlib/x86_64-unknown-linux-gnu/lib/libhashbrown.rlib prebuilt_rustc_sysroot/lib/rustlib/x86_64-unknown-linux-gnu/lib/libpanic_abort.rlib prebuilt_rustc_sysroot/lib/rustlib/x86_64-unknown-linux-gnu/lib/libpanic_unwind.rlib prebuilt_rustc_sysroot/lib/rustlib/x86_64-unknown-linux-gnu/lib/librustc_demangle.rlib prebuilt_rustc_sysroot/lib/rustlib/x86_64-unknown-linux-gnu/lib/libstd_detect.rlib prebuilt_rustc_sysroot/lib/rustlib/x86_64-unknown-linux-gnu/lib/libtest.rlib prebuilt_rustc_sysroot/lib/rustlib/x86_64-unknown-linux-gnu/lib/libunicode_width.rlib prebuilt_rustc_sysroot/lib/rustlib/x86_64-unknown-linux-gnu/lib/libunwind.rlib prebuilt_rustc_sysroot/lib/rustlib/x86_64-unknown-linux-gnu/lib/libaddr2line.rlib prebuilt_rustc_sysroot/lib/rustlib/x86_64-unknown-linux-gnu/lib/libadler2.rlib prebuilt_rustc_sysroot/lib/rustlib/x86_64-unknown-linux-gnu/lib/libgimli.rlib prebuilt_rustc_sysroot/lib/rustlib/x86_64-unknown-linux-gnu/lib/liblibc.rlib prebuilt_rustc_sysroot/lib/rustlib/x86_64-unknown-linux-gnu/lib/libmemchr.rlib prebuilt_rustc_sysroot/lib/rustlib/x86_64-unknown-linux-gnu/lib/libminiz_oxide.rlib prebuilt_rustc_sysroot/lib/rustlib/x86_64-unknown-linux-gnu/lib/libobject.rlib -Wl,-z,relro -Wl,--as-needed -Wl,-z,pack-relative-relocs -Wl,-z,now -specs=/usr/lib/rpm/redhat/redhat-hardened-ld -specs=/usr/lib/rpm/redhat/redhat-hardened-ld-errors -specs=/usr/lib/rpm/redhat/redhat-annobin-cc1 -Wl,--build-id=sha1 -specs=/usr/lib/rpm/redhat/redhat-package-notes -o "./transport_security_state_generator" -Wl,--start-group @"./transport_security_state_generator.rsp" -Wl,--end-group /usr/lib/clang/21/lib/x86_64-redhat-linux-gnu/libclang_rt.builtins.a -ldl -lpthread -lrt -lglib-2.0 -lgmodule-2.0 -lgobject-2.0 -lgthread-2.0 -latomic -ldouble-conversion -lnspr4 -lnss3 -lnssutil3 -lplc4 -lplds4 -lsmime3 -Wl,--start-group obj/third_party/rust/cxx/v1/lib/libcxx_lib.rlib obj/third_party/rust/foldhash/v0_1/lib/libfoldhash_lib.rlib obj/build/rust/allocator/libbuild_srust_sallocator_callocator.rlib obj/build/rust/allocator/liballoc_error_handler_impl_ffi.rlib obj/build/rust/allocator/liballocator_impls_ffi.rlib obj/base/libbase_crust_ulogger.rlib obj/base/libbase_clogging_ulog_useverity_ubindgen.rlib obj/third_party/rust/log/v0_4/lib/liblog_lib.rlib obj/build/rust/chromium_prelude/libchromium.rlib obj/third_party/rust/serde_json_lenient/v0_2/wrapper/libthird_uparty_srust_sserde_ujson_ulenient_sv0_u2_swrapper_cwrapper.rlib obj/third_party/rust/serde/v1/lib/libserde_lib.rlib obj/third_party/rust/serde_json_lenient/v0_2/lib/libserde_json_lenient_lib.rlib obj/third_party/rust/itoa/v1/lib/libitoa_lib.rlib obj/third_party/rust/memchr/v2/lib/libmemchr_lib.rlib obj/third_party/rust/ryu/v1/lib/libryu_lib.rlib -Wl,--end-group clang++: warning: argument unused during compilation: '-specs=/usr/lib/rpm/redhat/redhat-hardened-ld' [-Wunused-command-line-argument] clang++: warning: argument unused during compilation: '-specs=/usr/lib/rpm/redhat/redhat-hardened-ld-errors' [-Wunused-command-line-argument] clang++: warning: argument unused during compilation: '-specs=/usr/lib/rpm/redhat/redhat-annobin-cc1' [-Wunused-command-line-argument] clang++: warning: argument unused during compilation: '-specs=/usr/lib/rpm/redhat/redhat-package-notes' [-Wunused-command-line-argument] ld.lld: error: undefined symbol: __rustc::__rust_alloc_error_handler_should_panic_v2 >>> referenced by alloc.rs:435 (library/alloc/src/alloc.rs:435) >>> alloc-89c079dc503872cc.alloc.6e7db227d0aa2641-cgu.0.rcgu.o:(__rustc::__rdl_oom) in archive prebuilt_rustc_sysroot/lib/rustlib/x86_64-unknown-linux-gnu/lib/liballoc.rlib >>> referenced by alloc.rs:355 (library/std/src/alloc.rs:355) >>> std-b50617b29e31fd0b.std.2a1a0cc949c77e59-cgu.0.rcgu.o:(std::alloc::default_alloc_error_hook::heae949e1e5961fe0) in archive prebuilt_rustc_sysroot/lib/rustlib/x86_64-unknown-linux-gnu/lib/libstd.rlib For more info please have a look at the build log: https://koji.fedoraproject.org/koji/taskinfo?taskID=137249184 Expected Results: It should build without this problem Additional Information: The chromium built fine on F43 with rust-1.98.
Sorry, i mean The chromium built fine on F43 with rust-1.89.
Chromium is messing with unstable features and internal symbols here, and these things are subject to change. It looks like upstream has already handled this though: https://issues.chromium.org/issues/440481922 https://chromium-review.googlesource.com/c/chromium/src/+/6875644
Hi Josh, Indeed, it is a bug in Chromium, thank you for the info!
It's now fixed in Rawhide (F44) https://bodhi.fedoraproject.org/updates/FEDORA-2025-10b1d2beeb