Fedora Account System
Red Hat Associate
Red Hat Customer
Releases retrieved: 3.13.0 Upstream release that is considered latest: 3.13.0 Current version/release in rawhide: 3.12.4-1.fc45 URL: https://gdal.org Please consult the package updates policy before you issue an update to a stable branch: https://docs.fedoraproject.org/en-US/fesco/Updates_Policy/ More information about the service that created this bug can be found at: https://docs.fedoraproject.org/en-US/package-maintainers/Upstream_Release_Monitoring Please keep in mind that with any upstream change, there may also be packaging changes that need to be made. Specifically, please remember that it is your responsibility to review the new version to ensure that the licensing is still correct and that no non-free or legally problematic items have been added upstream. Based on the information from Anitya: https://release-monitoring.org/project/881/ To change the monitoring settings for the project, please visit: https://src.fedoraproject.org/rpms/gdal
Scratch build failed. Details below: BuilderException: Build failed: Command '['rpmbuild', '-D', '_sourcedir .', '-D', '_topdir .', '-bs', '/var/tmp/thn-1e2rdiof/gdal.spec']' returned non-zero exit status 1. StdOut: setting SOURCE_DATE_EPOCH=1778198400 error: Bad file: gdal-3.13.0-fedora.tar.xz: No such file or directory RPM build errors: Bad file: gdal-3.13.0-fedora.tar.xz: No such file or directory Traceback: File "/usr/local/lib/python3.14/site-packages/hotness/use_cases/package_scratch_build_use_case.py", line 55, in build result = self.builder.build(request.package, request.opts) File "/usr/local/lib/python3.14/site-packages/hotness/builders/koji.py", line 251, in build raise BuilderException( str(exc), value=output, std_out=std_out, std_err=std_err ) If you think this issue is caused by some bug in the-new-hotness, please report it on the-new-hotness issue tracker: https://github.com/fedora-infra/the-new-hotness/issues
Created attachment 2140308 [details] Update to 3.13.0 (#2468016)
Releases retrieved: 3.13.1RC1 Upstream release that is considered latest: 3.13.1RC1 Current version/release in rawhide: 3.12.4-4.fc45 URL: https://gdal.org Please consult the package updates policy before you issue an update to a stable branch: https://docs.fedoraproject.org/en-US/fesco/Updates_Policy/ More information about the service that created this bug can be found at: https://docs.fedoraproject.org/en-US/package-maintainers/Upstream_Release_Monitoring Please keep in mind that with any upstream change, there may also be packaging changes that need to be made. Specifically, please remember that it is your responsibility to review the new version to ensure that the licensing is still correct and that no non-free or legally problematic items have been added upstream. Based on the information from Anitya: https://release-monitoring.org/project/881/ To change the monitoring settings for the project, please visit: https://src.fedoraproject.org/rpms/gdal
Scratch build failed. Details below: BuilderException: Build failed: Command '['rpmbuild', '-D', '_sourcedir .', '-D', '_topdir .', '-bs', '/var/tmp/thn-mbshm1e1/gdal.spec']' returned non-zero exit status 1. StdOut: setting SOURCE_DATE_EPOCH=1780272000 error: Bad file: gdal-3.13.1RC1-fedora.tar.xz: No such file or directory error: Bad file: gdalautotest-3.13.1RC1.zip: No such file or directory RPM build errors: Bad file: gdal-3.13.1RC1-fedora.tar.xz: No such file or directory Bad file: gdalautotest-3.13.1RC1.zip: No such file or directory Traceback: File "/usr/local/lib/python3.14/site-packages/hotness/use_cases/package_scratch_build_use_case.py", line 55, in build result = self.builder.build(request.package, request.opts) File "/usr/local/lib/python3.14/site-packages/hotness/builders/koji.py", line 251, in build raise BuilderException( str(exc), value=output, std_out=std_out, std_err=std_err ) If you think this issue is caused by some bug in the-new-hotness, please report it on the-new-hotness issue tracker: https://github.com/fedora-infra/the-new-hotness/issues
Created attachment 2143651 [details] Update to 3.13.1RC1 (#2468016)
Releases retrieved: 3.13.1 Upstream release that is considered latest: 3.13.1 Current version/release in rawhide: 3.12.4-4.fc45 URL: https://gdal.org Please consult the package updates policy before you issue an update to a stable branch: https://docs.fedoraproject.org/en-US/fesco/Updates_Policy/ More information about the service that created this bug can be found at: https://docs.fedoraproject.org/en-US/package-maintainers/Upstream_Release_Monitoring Please keep in mind that with any upstream change, there may also be packaging changes that need to be made. Specifically, please remember that it is your responsibility to review the new version to ensure that the licensing is still correct and that no non-free or legally problematic items have been added upstream. Based on the information from Anitya: https://release-monitoring.org/project/881/ To change the monitoring settings for the project, please visit: https://src.fedoraproject.org/rpms/gdal
Scratch build failed. Details below: BuilderException: Build failed: Command '['rpmbuild', '-D', '_sourcedir .', '-D', '_topdir .', '-bs', '/var/tmp/thn-0df89ail/gdal.spec']' returned non-zero exit status 1. StdOut: setting SOURCE_DATE_EPOCH=1780617600 error: Bad file: gdal-3.13.1-fedora.tar.xz: No such file or directory RPM build errors: Bad file: gdal-3.13.1-fedora.tar.xz: No such file or directory Traceback: File "/usr/local/lib/python3.14/site-packages/hotness/use_cases/package_scratch_build_use_case.py", line 55, in build result = self.builder.build(request.package, request.opts) File "/usr/local/lib/python3.14/site-packages/hotness/builders/koji.py", line 251, in build raise BuilderException( str(exc), value=output, std_out=std_out, std_err=std_err ) If you think this issue is caused by some bug in the-new-hotness, please report it on the-new-hotness issue tracker: https://github.com/fedora-infra/the-new-hotness/issues
Created attachment 2144348 [details] Update to 3.13.1 (#2468016)
FEDORA-2026-7c38dea7aa (gdal-3.13.1-1.fc45, GMT-6.6.0-8.fc45, and 21 more) has been submitted as an update to Fedora 45. https://bodhi.fedoraproject.org/updates/FEDORA-2026-7c38dea7aa
FEDORA-2026-7c38dea7aa (gdal-3.13.1-1.fc45, GMT-6.6.0-8.fc45, and 21 more) has been pushed to the Fedora 45 stable repository. If problem still persists, please make note of it in this bug report.