Bug 433984 - nx failed massrebuild attempt for GCC 4.3
Summary: nx failed massrebuild attempt for GCC 4.3
Status: CLOSED RAWHIDE
Alias: None
Product: Fedora
Classification: Fedora
Component: nx
Version: 9
Hardware: All
OS: Linux
medium
medium
Target Milestone: ---
Assignee: Axel Thimm
QA Contact: Fedora Extras Quality Assurance
URL:
Whiteboard:
Keywords:
: 440915 (view as bug list)
Depends On:
Blocks: gcc43errors
TreeView+ depends on / blocked
 
Reported: 2008-02-22 12:52 UTC by Jesse Keating
Modified: 2013-01-10 02:47 UTC (History)
4 users (show)

(edit)
Clone Of:
(edit)
Last Closed: 2008-05-20 15:25:53 UTC


Attachments (Terms of Use)

Description Jesse Keating 2008-02-22 12:52:40 UTC
This is an automatically filed bug for a failed rebuild attempt for GCC 4.3.

http://fedoraproject.org/wiki/JesseKeating/gcc43MassRebuildProposal

Please verify why this build failed and fix it.
http://koji.fedoraproject.org/koji/taskinfo?taskID=436255
Exit code was 1, check the build.log for the failed buildArch task.

Comment 1 Jon Stanley 2008-02-22 18:26:47 UTC
lots of spewage, mostly undeclared symbols, but some other stuff:

Loop.cpp:14135: error: 'logofs' was not declared in this scope
Loop.cpp:14166: error: expected type-specifier before 'ofstream'
Loop.cpp:14166: error: expected `)' before 'ofstream'
Loop.cpp:14171: error: expected `)' before 'usleep'

http://koji.fedoraproject.org/koji/getfile?taskID=437772&name=build.log

Comment 2 Axel Thimm 2008-04-05 10:28:31 UTC
*** Bug 440915 has been marked as a duplicate of this bug. ***

Comment 3 Bug Zapper 2008-05-14 05:21:50 UTC
Changing version to '9' as part of upcoming Fedora 9 GA.
More information and reason for this action is here:
http://fedoraproject.org/wiki/BugZappers/HouseKeeping

Comment 4 Axel Thimm 2008-05-20 15:25:53 UTC
nx was built for F9, but this bug was forgotten open.


Note You need to log in before you can comment on or make changes to this bug.