Bug 433998 - vdccm failed massrebuild attempt for GCC 4.3
vdccm failed massrebuild attempt for GCC 4.3
Status: CLOSED NEXTRELEASE
Product: Fedora
Classification: Fedora
Component: vdccm (Show other bugs)
rawhide
All Linux
medium Severity medium
: ---
: ---
Assigned To: Andreas Bierfert
Fedora Extras Quality Assurance
:
Depends On:
Blocks: gcc43errors
  Show dependency treegraph
 
Reported: 2008-02-22 07:54 EST by Jesse Keating
Modified: 2013-01-09 21:48 EST (History)
3 users (show)

See Also:
Fixed In Version:
Doc Type: Bug Fix
Doc Text:
Story Points: ---
Clone Of:
Environment:
Last Closed: 2008-02-22 10:37:13 EST
Type: ---
Regression: ---
Mount Type: ---
Documentation: ---
CRM:
Verified Versions:
Category: ---
oVirt Team: ---
RHEL 7.3 requirements from Atomic Host:
Cloudforms Team: ---


Attachments (Terms of Use)
Patch to fix gcc 4.3 compilation problems (854 bytes, patch)
2008-02-22 10:03 EST, Erik van Pienbroek
no flags Details | Diff

  None (edit)
Description Jesse Keating 2008-02-22 07:54:05 EST
This is an automatically filed bug for a failed rebuild attempt for GCC 4.3.

http://fedoraproject.org/wiki/JesseKeating/gcc43MassRebuildProposal

Please verify why this build failed and fix it.
http://koji.fedoraproject.org/koji/taskinfo?taskID=436678
Exit code was 1, check the build.log for the failed buildArch task.
Comment 1 Tyler Owen 2008-02-22 09:17:10 EST
Errors in x86_64 build.log:

tcpsocket.cpp: In member function 'virtual bool TCPSocket::bind()':
tcpsocket.cpp:80: error: 'memcpy' was not declared in this scope
tcpsocket.cpp:84: error: 'memcpy' was not declared in this scope
make[2]: *** [tcpsocket.lo] Error 1
Comment 2 Erik van Pienbroek 2008-02-22 10:03:23 EST
Created attachment 295638 [details]
Patch to fix gcc 4.3 compilation problems
Comment 3 Andreas Bierfert 2008-02-22 10:37:13 EST
Hehe just as I was to close the bug myself. Thanks anyhow :)

Note You need to log in before you can comment on or make changes to this bug.