Bug 434028 - kpolynome failed massrebuild attempt for GCC 4.3
Summary: kpolynome failed massrebuild attempt for GCC 4.3
Keywords:
Status: CLOSED RAWHIDE
Alias: None
Product: Fedora
Classification: Fedora
Component: kpolynome
Version: rawhide
Hardware: All
OS: Linux
medium
medium
Target Milestone: ---
Assignee: Chitlesh GOORAH
QA Contact: Fedora Extras Quality Assurance
URL:
Whiteboard:
Depends On:
Blocks: gcc43rebuildfail
TreeView+ depends on / blocked
 
Reported: 2008-02-22 12:57 UTC by Jesse Keating
Modified: 2013-01-10 02:50 UTC (History)
3 users (show)

Fixed In Version:
Doc Type: Bug Fix
Doc Text:
Clone Of:
Environment:
Last Closed: 2008-03-31 19:12:04 UTC


Attachments (Terms of Use)

Description Jesse Keating 2008-02-22 12:57:15 UTC
This is an automatically filed bug for a failed rebuild attempt for GCC 4.3.

http://fedoraproject.org/wiki/JesseKeating/gcc43MassRebuildProposal

Please verify why this build failed and fix it.
http://koji.fedoraproject.org/koji/taskinfo?taskID=437294
Exit code was 1, check the build.log for the failed buildArch task.

Comment 1 Jon Stanley 2008-02-23 20:13:22 UTC
checking for kde-config... not found
configure: error: The important program kde-config was not found!
Please check whether you installed KDE correctly.

Comment 2 Christopher Aillon 2008-03-28 20:20:05 UTC
After fixing the buildroot (which has been that way since the start of the F9
cycle... please look after your packages):

http://koji.fedoraproject.org/koji/getfile?taskID=536686&name=build.log

drawwidget.cpp: In member function 'void drawwidget::drawPolynome(QPainter*)':
drawwidget.cpp:324: error: 'abs' was not declared in this scope
make[2]: *** [drawwidget.o] Error 1
make[2]: *** Waiting for unfinished jobs....
mv -f .deps/main.Tpo .deps/main.Po
mv -f .deps/maindialog.Tpo .deps/maindialog.Po
make[2]: Leaving directory `/builddir/build/BUILD/kpolynome-0.1/src'
make[1]: *** [all-recursive] Error 1
make[1]: Leaving directory `/builddir/build/BUILD/kpolynome-0.1'
make: *** [all] Error 2


Comment 3 Christopher Aillon 2008-03-28 20:20:58 UTC
Er, I meant buildreq of course.

Comment 4 Rex Dieter 2008-03-31 19:12:04 UTC
fixed in rawhide.


Note You need to log in before you can comment on or make changes to this bug.