Bug 434348 - gdl failed massrebuild attempt for GCC 4.3
Summary: gdl failed massrebuild attempt for GCC 4.3
Status: CLOSED RAWHIDE
Alias: None
Product: Fedora
Classification: Fedora
Component: gdl   
(Show other bugs)
Version: rawhide
Hardware: All Linux
medium
medium
Target Milestone: ---
Assignee: Orion Poplawski
QA Contact: Fedora Extras Quality Assurance
URL:
Whiteboard:
Keywords:
Depends On:
Blocks: gcc43errors
TreeView+ depends on / blocked
 
Reported: 2008-02-22 16:02 UTC by Jesse Keating
Modified: 2013-01-10 03:07 UTC (History)
3 users (show)

Fixed In Version:
Doc Type: Bug Fix
Doc Text:
Story Points: ---
Clone Of:
Environment:
Last Closed: 2008-03-04 21:57:58 UTC
Type: ---
Regression: ---
Mount Type: ---
Documentation: ---
CRM:
Verified Versions:
Category: ---
oVirt Team: ---
RHEL 7.3 requirements from Atomic Host:
Cloudforms Team: ---


Attachments (Terms of Use)

Description Jesse Keating 2008-02-22 16:02:54 UTC
This is an automatically filed bug for a failed rebuild attempt for GCC 4.3.

http://fedoraproject.org/wiki/JesseKeating/gcc43MassRebuildProposal

Please verify why this build failed and fix it.
http://koji.fedoraproject.org/koji/taskinfo?taskID=442872
Exit code was 1, check the build.log for the failed buildArch task.

Comment 1 Jon Stanley 2008-02-29 21:34:32 UTC
scratch build 480016

Comment 2 Jon Stanley 2008-02-29 21:43:03 UTC
In file included from CharScanner.cpp:10:
../../src/antlr/CharScanner.hpp: In member function 'bool
antlr::CharScannerLiteralsLess::operator()(const std::string&, const
std::string&) const':
../../src/antlr/CharScanner.hpp:539: error: 'strcasecmp' was not declared in
this scope
CharScanner.cpp: In member function 'virtual void antlr::CharScanner::panic()':
CharScanner.cpp:85: error: 'exit' was not declared in this scope
CharScanner.cpp: In member function 'virtual void
antlr::CharScanner::panic(const std::string&)':
CharScanner.cpp:91: error: 'exit' was not declared in this scope


Comment 3 Orion Poplawski 2008-02-29 22:05:41 UTC
Yeah, I believe I have fixes for all of these - waiting for fixed qhull ->
plplot -> gdl.

Comment 4 Orion Poplawski 2008-03-04 21:57:58 UTC
Fixed in rawhide.


Note You need to log in before you can comment on or make changes to this bug.