Bug 434381 - WebKit failed massrebuild attempt for GCC 4.3
Summary: WebKit failed massrebuild attempt for GCC 4.3
Keywords:
Status: CLOSED RAWHIDE
Alias: None
Product: Fedora
Classification: Fedora
Component: WebKit
Version: rawhide
Hardware: All
OS: Linux
medium
medium
Target Milestone: ---
Assignee: Peter Gordon
QA Contact: Fedora Extras Quality Assurance
URL:
Whiteboard:
Depends On:
Blocks: gcc43errors
TreeView+ depends on / blocked
 
Reported: 2008-02-22 16:06 UTC by Jesse Keating
Modified: 2013-01-10 03:10 UTC (History)
2 users (show)

Fixed In Version:
Doc Type: Bug Fix
Doc Text:
Clone Of:
Environment:
Last Closed: 2008-03-01 17:04:02 UTC
Type: ---


Attachments (Terms of Use)

Description Jesse Keating 2008-02-22 16:06:55 UTC
This is an automatically filed bug for a failed rebuild attempt for GCC 4.3.

http://fedoraproject.org/wiki/JesseKeating/gcc43MassRebuildProposal

Please verify why this build failed and fix it.
http://koji.fedoraproject.org/koji/taskinfo?taskID=443341
Exit code was 1, check the build.log for the failed buildArch task.

Comment 1 Jon Stanley 2008-03-01 02:56:17 UTC
scratch build 480763

Comment 2 Jon Stanley 2008-03-01 03:12:48 UTC
../../WebCore/dom/Position.cpp: In member function 'void
WebCore::Position::debugPosition(const char*) const':
../../WebCore/dom/Position.cpp:666: error: 'stderr' was not declared in this scope
../../WebCore/dom/Position.cpp:666: error: 'fprintf' was not declared in this scope
../../WebCore/dom/Position.cpp:668: error: 'stderr' was not declared in this scope
../../WebCore/dom/Position.cpp:668: error: 'fprintf' was not declared in this scope

Comment 3 Peter Gordon 2008-03-01 05:24:48 UTC
Thanks. A whole slew of files need various #include fixes. I'm working through
this now.

Comment 4 Peter Gordon 2008-03-01 17:04:02 UTC
Fixed in 1.0.0-0.5.svn30667.fc9, which should hit Rawhide shortly.


Note You need to log in before you can comment on or make changes to this bug.