Bug 434437 - srecord failed massrebuild attempt for GCC 4.3
srecord failed massrebuild attempt for GCC 4.3
Status: CLOSED RAWHIDE
Product: Fedora
Classification: Fedora
Component: srecord (Show other bugs)
rawhide
All Linux
medium Severity medium
: ---
: ---
Assigned To: Tom "spot" Callaway
Fedora Extras Quality Assurance
:
Depends On:
Blocks: gcc43errors
  Show dependency treegraph
 
Reported: 2008-02-22 11:24 EST by Jesse Keating
Modified: 2013-01-09 22:12 EST (History)
2 users (show)

See Also:
Fixed In Version:
Doc Type: Bug Fix
Doc Text:
Story Points: ---
Clone Of:
Environment:
Last Closed: 2008-03-11 09:34:02 EDT
Type: ---
Regression: ---
Mount Type: ---
Documentation: ---
CRM:
Verified Versions:
Category: ---
oVirt Team: ---
RHEL 7.3 requirements from Atomic Host:
Cloudforms Team: ---


Attachments (Terms of Use)

  None (edit)
Description Jesse Keating 2008-02-22 11:24:15 EST
This is an automatically filed bug for a failed rebuild attempt for GCC 4.3.

http://fedoraproject.org/wiki/JesseKeating/gcc43MassRebuildProposal

Please verify why this build failed and fix it.
http://koji.fedoraproject.org/koji/taskinfo?taskID=445319
Exit code was 1, check the build.log for the failed buildArch task.
Comment 1 Jon Stanley 2008-03-05 00:12:24 EST
scratch build 493097
Comment 2 Jon Stanley 2008-03-05 00:26:03 EST
lib/arglex.cc: In member function 'void arglex::help(const char*) const':
lib/arglex.cc:618: error: 'exit' was not declared in this scope
lib/arglex.cc: In member function 'void arglex::version() const':
lib/arglex.cc:638: error: 'exit' was not declared in this scope
lib/arglex.cc: In member function 'int arglex::token_first()':
lib/arglex.cc:709: error: 'exit' was not declared in this scope
lib/arglex.cc: In member function 'void arglex::usage() const':
lib/arglex.cc:739: error: 'exit' was not declared in this scope
Comment 3 Tom "spot" Callaway 2008-03-11 09:34:02 EDT
Fixed in srecord-1.39-2.fc9.

Note You need to log in before you can comment on or make changes to this bug.