Fedora Account System
Red Hat Associate
Red Hat Customer
In working to update to exiv2-0.19 in rawhide, hit a snag that pyexiv2-0.1.3 doesn't build. scons: done reading SConscript files. scons: Building targets ... g++ -o build/libpyexiv2.os -c -O2 -g -pipe -Wall -Wp,-D_FORTIFY_SOURCE=2 -fexceptions -fstack-protector --param=ssp-buffer-size=4 -m64 -mtune=generic -fPIC -I/usr/include/python2.6 src/libpyexiv2.cpp src/libpyexiv2.cpp: In member function 'boost::python::tuple LibPyExiv2::Image::setIptcTag(std::string, std::string, unsigned int)': src/libpyexiv2.cpp:231: error: 'Exiv2::FindMetadatumById' has not been declared src/libpyexiv2.cpp: In member function 'boost::python::tuple LibPyExiv2::Image::deleteIptcTag(std::string, unsigned int)': src/libpyexiv2.cpp:269: error: 'Exiv2::FindMetadatumById' has not been declared scons: *** [build/libpyexiv2.os] Error 1 scons: building terminated because of errors. Per the linked launchpad bug, it would appear Ubuntu developers have already contacted pyexiv2 authors, but I would appreciate it if you could (help) do the same.
If progress on getting pyexiv2 ported promptly, I can look into providing some sort of compat-exiv2-0.18.x package in the meantime
If progress isn't prompt... that is.
snagged patch from ubuntu, looks like a winner.