Bug 57173 - kdemultimedia-2.2.2-1. Rebuild problem
Summary: kdemultimedia-2.2.2-1. Rebuild problem
Alias: None
Product: Red Hat Raw Hide
Classification: Retired
Component: kdemultimedia   
(Show other bugs)
Version: 1.0
Hardware: i386 Linux
Target Milestone: ---
Assignee: Bernhard Rosenkraenzer
QA Contact:
Depends On:
TreeView+ depends on / blocked
Reported: 2001-12-06 12:49 UTC by Need Real Name
Modified: 2008-05-01 15:38 UTC (History)
0 users

Fixed In Version:
Doc Type: Bug Fix
Doc Text:
Story Points: ---
Clone Of:
Last Closed: 2001-12-06 12:49:38 UTC
Type: ---
Regression: ---
Mount Type: ---
Documentation: ---
Verified Versions:
Category: ---
oVirt Team: ---
RHEL 7.3 requirements from Atomic Host:
Cloudforms Team: ---

Attachments (Terms of Use)

Description Need Real Name 2001-12-06 12:49:33 UTC
I am trying to rebuild all the packages from KDE 2.2.2 and I have a
problem with kdemultimedia-2.2.2-1.

When I type rpm --rebuild kdemultimedia-2.2.2-1.src.rpm it ends up with
the following error:

Making all in arts
make[3]: Entering directory
/bin/sh ../../libtool --mode=compile --tag=CXX c++ -DHAVE_CONFIG_H -I.
-I. -I../.. -I/usr/include/kde -I/usr/lib/qt-2.3.1/include
-I/usr/X11R6/include  -I/usr/include/kde/arts -I../../libltdl     -O2
-O2 -march=i386 -mcpu=i686 -DNDEBUG -fno-check-new -fno-exceptions
-c BrahmsMidiRecorder.cpp
mkdir .libs
c++ -DHAVE_CONFIG_H -I. -I. -I../.. -I/usr/include/kde
-I/usr/lib/qt-2.3.1/include -I/usr/X11R6/include -I/usr/include/kde/arts
-I../../libltdl -O2 -O2 -march=i386 -mcpu=i686 -DNDEBUG -fno-check-new
-fno-exceptions -fno-check-new -DQT_CLEAN_NAMESPACE -DQT_NO_COMPAT
-DQT_NO_ASCII_CAST -Wp,-MD,.deps/BrahmsMidiRecorder.pp -c
BrahmsMidiRecorder.cpp  -fPIC -DPIC -o .libs/BrahmsMidiRecorder.o
In file included from BrahmsMidiRecorder.cpp:4:
BrahmsArts.h:9:22: artsmidi.h: No such file or directory
make[3]: *** [BrahmsMidiRecorder.lo] Error 1
make[3]: Leaving directory
make[2]: *** [all-recursive] Error 1
make[2]: Leaving directory
make[1]: *** [all-recursive] Error 1
make[1]: Leaving directory
make: *** [all-recursive-am] Error 2
error: Bad exit status from /var/tmp/rpm-tmp.95153 (%build)

RPM build errors:
    Bad exit status from /var/tmp/rpm-tmp.95153 (%build)

Then when I try to locate the file artsmidi.h I obtain the following:

[root@brest bin]# updatedb
[root@brest bin]# locate artsmidi.h

Typically the "eggs and chicken" dilemna...


Comment 1 Bernhard Rosenkraenzer 2002-01-22 21:25:08 UTC
Fixed in 2.2.2-2

Note You need to log in before you can comment on or make changes to this bug.