Bug 612666 - kdebindings: smoke/qtgui build failure against qt-4.7
kdebindings: smoke/qtgui build failure against qt-4.7
Status: CLOSED RAWHIDE
Product: Fedora
Classification: Fedora
Component: kdebindings (Show other bugs)
rawhide
All Linux
low Severity medium
: ---
: ---
Assigned To: Kevin Kofler
Fedora Extras Quality Assurance
:
Depends On:
Blocks: qt47
  Show dependency treegraph
 
Reported: 2010-07-08 14:18 EDT by Rex Dieter
Modified: 2010-07-09 05:58 EDT (History)
8 users (show)

See Also:
Fixed In Version: kdebindings-4.4.92-2.fc14
Doc Type: Bug Fix
Doc Text:
Story Points: ---
Clone Of:
Environment:
Last Closed: 2010-07-09 01:47:32 EDT
Type: ---
Regression: ---
Mount Type: ---
Documentation: ---
CRM:
Verified Versions:
Category: ---
oVirt Team: ---
RHEL 7.3 requirements from Atomic Host:
Cloudforms Team: ---


Attachments (Terms of Use)


External Trackers
Tracker ID Priority Status Summary Last Updated
KDE Software Compilation 243971 None None None Never

  None (edit)
Description Rex Dieter 2010-07-08 14:18:24 EDT
last tried with kdebindings-4.4.92 and qt-4.7.0-0.26.beta2,

[ 13%] Building CXX object smoke/qtgui/CMakeFiles/smokeqtgui.dir/x_20.o
cd /builddir/build/BUILD/kdebindings-4.4.92/x86_64-redhat-linux-gnu/smoke/qtgui && /usr/bin/c++   -Dsmokeqtgui_EXPORTS -D_BSD_SOURCE -D_XOPEN_SOURCE=500 -D_BSD_SOURCE -DQT_NO_STL -DQT_NO_CAST_TO_ASCII -D_REENTRANT -DKDE_DEPRECATED_WARNINGS -DQT3_SUPPORT -DSMOKE_BUILDING -DGCC_VISIBILITY -O2 -g -pipe -Wall -Wp,-D_FORTIFY_SOURCE=2 -fexceptions -fstack-protector --param=ssp-buffer-size=4 -m64 -mtune=generic  -Wnon-virtual-dtor -Wno-long-long -ansi -Wundef -Wcast-align -Wchar-subscripts -Wall -W -Wpointer-arith -Wformat-security -fno-exceptions -DQT_NO_EXCEPTIONS -fno-check-new -fno-common -Woverloaded-virtual -fno-threadsafe-statics -fvisibility=hidden -fvisibility-inlines-hidden -O2 -DNDEBUG -DQT_NO_DEBUG -fPIC -I/builddir/build/BUILD/kdebindings-4.4.92/x86_64-redhat-linux-gnu/smoke/qtgui -I/builddir/build/BUILD/kdebindings-4.4.92/smoke/qtgui -I/builddir/build/BUILD/kdebindings-4.4.92 -I/builddir/build/BUILD/kdebindings-4.4.92/x86_64-redhat-linux-gnu -I/builddir/build/BUILD/kdebindings-4.4.92/smoke -I/usr/include/kde4 -I/usr/include/kde4/KDE -I/usr/include/KDE -I/usr/include/phonon -I/usr/include/QtXmlPatterns -I/usr/include/QtXml -I/usr/include/QtWebKit -I/usr/include/QtUiTools -I/usr/include/QtTest -I/usr/include/QtSvg -I/usr/include/QtSql -I/usr/include/QtScriptTools -I/usr/include/QtScript -I/usr/include/QtOpenGL -I/usr/include/QtNetwork -I/usr/include/QtMultimedia -I/usr/include/QtHelp -I/usr/include/QtDesigner -I/usr/include/QtDeclarative -I/usr/include/QtDBus -I/usr/include/Qt3Support -I/usr/include/QtGui -I/usr/include/QtCore -I/usr/include/Qt -I/usr/lib64/qt4/mkspecs/default   -D_GNU_SOURCE -D_LARGEFILE64_SOURCE -o CMakeFiles/smokeqtgui.dir/x_20.o -c /builddir/build/BUILD/kdebindings-4.4.92/x86_64-redhat-linux-gnu/smoke/qtgui/x_20.cpp
/builddir/build/BUILD/kdebindings-4.4.92/x86_64-redhat-linux-gnu/smoke/qtgui/x_20.cpp: In static member function 'static void __smokeqtgui::x_QGlobalSpace::x_776(Smoke::StackItem*)':
/builddir/build/BUILD/kdebindings-4.4.92/x86_64-redhat-linux-gnu/smoke/qtgui/x_20.cpp:20978:29: error: 'PM_FrameCornerWidth' was not declared in this scope
/builddir/build/BUILD/kdebindings-4.4.92/x86_64-redhat-linux-gnu/smoke/qtgui/x_20.cpp: In static member function 'static void __smokeqtgui::x_QGlobalSpace::x_777(Smoke::StackItem*)':
/builddir/build/BUILD/kdebindings-4.4.92/x86_64-redhat-linux-gnu/smoke/qtgui/x_20.cpp:20981:29: error: 'PM_FrameCornerHeight' was not declared in this scope
/builddir/build/BUILD/kdebindings-4.4.92/x86_64-redhat-linux-gnu/smoke/qtgui/x_20.cpp: In static member function 'static void __smokeqtgui::x_QGlobalSpace::x_778(Smoke::StackItem*)':
/builddir/build/BUILD/kdebindings-4.4.92/x86_64-redhat-linux-gnu/smoke/qtgui/x_20.cpp:20984:29: error: 'PM_BoldLineWidth' was not declared in this scope
/builddir/build/BUILD/kdebindings-4.4.92/x86_64-redhat-linux-gnu/smoke/qtgui/x_20.cpp: In static member function 'static void __smokeqtgui::x_QGlobalSpace::x_779(Smoke::StackItem*)':
/builddir/build/BUILD/kdebindings-4.4.92/x86_64-redhat-linux-gnu/smoke/qtgui/x_20.cpp:20987:29: error: 'PM_ThinLineWidth' was not declared in this scope
/builddir/build/BUILD/kdebindings-4.4.92/x86_64-redhat-linux-gnu/smoke/qtgui/x_20.cpp: In static member function 'static void __smokeqtgui::x_QGlobalSpace::x_780(Smoke::StackItem*)':
/builddir/build/BUILD/kdebindings-4.4.92/x86_64-redhat-linux-gnu/smoke/qtgui/x_20.cpp:20990:29: error: 'PM_MessageBoxHeight' was not declared in this scope
make[2]: Leaving directory `/builddir/build/BUILD/kdebindings-4.4.92/x86_64-redhat-linux-gnu'
Comment 1 Kevin Kofler 2010-07-09 01:47:32 EDT
Fixed in 4.4.92-2.
Comment 2 Kevin Kofler 2010-07-09 05:58:57 EDT
4.4.92-3 now has the upstream fix.

Note You need to log in before you can comment on or make changes to this bug.