Bug 83474 - SPEC file is missing dependency
Summary: SPEC file is missing dependency
Keywords:
Status: CLOSED RAWHIDE
Alias: None
Product: Red Hat Raw Hide
Classification: Retired
Component: docbook-utils
Version: 1.0
Hardware: i686
OS: Linux
medium
medium
Target Milestone: ---
Assignee: Tim Waugh
QA Contact:
URL:
Whiteboard:
Depends On:
Blocks: 79579
TreeView+ depends on / blocked
 
Reported: 2003-02-04 18:56 UTC by Michael Lee Yohe
Modified: 2008-05-01 15:38 UTC (History)
0 users

Fixed In Version:
Doc Type: Bug Fix
Doc Text:
Clone Of:
Environment:
Last Closed: 2003-02-05 08:44:39 UTC


Attachments (Terms of Use)

Description Michael Lee Yohe 2003-02-04 18:56:41 UTC
From Bugzilla Helper:
User-Agent: Mozilla/5.0 Galeon/1.2.7 (X11; Linux i686; U;) Gecko/20030102

Description of problem:
SGML_CATALOG_FILES=/etc/sgml/catalog \
SGML_SEARCH_PATH=../../doc:.. \
	nsgmls ../../doc/docbook-utils.sgml | \
	sgmlspl ../../helpers/docbook2man-spec.pl
/bin/sh: line 1: sgmlspl: command not found
make[2]: *** [jw.1] Error 127
make[2]: Leaving directory `/usr/src/redhat/BUILD/docbook-utils-0.6.12/doc/man'
make[1]: *** [all-recursive] Error 1
make[1]: Leaving directory `/usr/src/redhat/BUILD/docbook-utils-0.6.12/doc'
make: *** [all-recursive] Error 1
error: Bad exit status from /var/tmp/rpm-tmp.95221 (%build)

When attempting to build a binary from the SPEC file - you receive the following
error.  Installing the perl-SGMLSpm package corrects this issue (adds sgmlpl).

Version-Release number of selected component (if applicable):


How reproducible:
Always

Steps to Reproduce:
1. see description

Additional info:

SRPM involved: docbook-utils-0.6.12-4.src.rpm

Comment 1 Tim Waugh 2003-02-05 08:44:39 UTC
Fixed package is 0.6.12-5, which will shortly appear in rawhide.


Note You need to log in before you can comment on or make changes to this bug.