Bugzilla (bugzilla.redhat.com) will be under maintenance for infrastructure upgrades and will not be available on July 31st between 12:30 AM - 05:30 AM UTC. We appreciate your understanding and patience. You can follow status.redhat.com for details.
Bug 881722 - ami-e1b720db 5.6 x86_64 ap-southeast-2
Summary: ami-e1b720db 5.6 x86_64 ap-southeast-2
Keywords:
Status: CLOSED WONTFIX
Alias: None
Product: Cloud Image Validation
Classification: Red Hat
Component: images
Version: RHEL5.6
Hardware: x86_64
OS: Unspecified
unspecified
unspecified
Target Milestone: ---
Assignee: mkovacik
QA Contact: mkovacik
URL:
Whiteboard:
Depends On:
Blocks:
TreeView+ depends on / blocked
 
Reported: 2012-11-29 12:46 UTC by mkovacik
Modified: 2013-05-15 08:41 UTC (History)
1 user (show)

Fixed In Version:
Doc Type: Bug Fix
Doc Text:
Clone Of:
Environment:
Last Closed: 2013-05-15 08:41:56 UTC
Target Upstream Version:


Attachments (Terms of Use)

Description mkovacik 2012-11-29 12:46:03 UTC

Comment 1 Martin Kočí 2012-11-29 13:39:19 UTC
ec2-54-252-44-116.ap-southeast-2.compute.amazonaws.com terminated with exit code 0
ec2-54-252-32-203.ap-southeast-2.compute.amazonaws.com terminated with exit code 0
ec2-54-252-23-165.ap-southeast-2.compute.amazonaws.com terminated with exit code 0
ec2-54-252-31-15.ap-southeast-2.compute.amazonaws.com terminated with exit code 0
ec2-54-252-29-38.ap-southeast-2.compute.amazonaws.com terminated with exit code 0
ec2-54-252-33-252.ap-southeast-2.compute.amazonaws.com terminated with exit code 0
ec2-54-252-52-103.ap-southeast-2.compute.amazonaws.com terminated with exit code 0


IMAGE ID= ami-e1b720db_ap-southeast-2_m1.xlarge
###### TEST KERNEL AFTER REBOOT ####  
######################################################################################
# NEW TEST: ## Verify disabled yum plugin ... 
######################################################################################
COMMAND:  grep ^enabled /etc/yum/pluginconf.d/rhnplugin.conf | grep -v '^#' | cut -d\= -f2 | awk '{print }' | sort -f | uniq
RESULT:  0 
EXPECTED RESULT: 
RETURN CODE: 0
PASS
######################################################################################
# NEW TEST: ## Verify kernel name ... 
######################################################################################
COMMAND:  /bin/uname -s
RESULT: Linux 
EXPECTED RESULT: Linux
RETURN CODE: 0
PASS
######################################################################################
# NEW TEST: ## Verify latest installed kernel is running ... 
######################################################################################
Detected rpm kernel version: 2.6.18-308.20.1.el5
Detected uname kernel version: 2.6.18-308.20.1.el5
COMMAND:  true
RESULT:  
EXPECTED RESULT: 
RETURN CODE: 0
PASS
######################################################################################
# NEW TEST: ## Verify latest kenerl is in /boot/grub/menu.1st ... 
######################################################################################
COMMAND:  cat /boot/grub/menu.lst | grep 2.6.18-308.20.1.el5
RESULT: title Red Hat Enterprise Linux Server (2.6.18-308.20.1.el5xen)
        kernel /boot/vmlinuz-2.6.18-308.20.1.el5xen ro root=LABEL=/ 
        initrd /boot/initrd-2.6.18-308.20.1.el5xen.img 
EXPECTED RESULT: 
RETURN CODE: 0
PASS
######################################################################################
# NEW TEST: ## Verify operating system ... 
######################################################################################
COMMAND:  /bin/uname -o
RESULT: GNU/Linux 
EXPECTED RESULT: GNU/Linux
RETURN CODE: 0
PASS
######################################################################################
# NEW TEST: ## Verify /etc/sysconfig/kernel ... 
######################################################################################
COMMAND:  ls /etc/sysconfig/kernel
RESULT: /etc/sysconfig/kernel 
EXPECTED RESULT: 
RETURN CODE: 0
PASS
######################################################################################
# NEW TEST: ## Verify /etc/sysconfig/kernel contains UPDATEDEFAULT ... 
######################################################################################
COMMAND:  cat /etc/sysconfig/kernel | grep UPDATEDEFAULT=yes
RESULT: UPDATEDEFAULT=yes 
EXPECTED RESULT: 
RETURN CODE: 0
PASS
######################################################################################
# NEW TEST: ## Verify /etc/sysconfig/kernel contains DEFAULTKERNEL ... 
######################################################################################
COMMAND:  cat /etc/sysconfig/kernel | grep DEFAULTKERNEL=kernel
RESULT: DEFAULTKERNEL=kernel 
EXPECTED RESULT: 
RETURN CODE: 0
PASS
######################################################################################
# NEW TEST: ## Verify system up to date
######################################################################################
COMMAND:  _check_sys_update_phase1
# update was required; previous version: Red Hat Enterprise Linux Server release 5.6 (Tikanga)... and was done; new version: Red Hat Enterprise Linux Server release 5.8 (Tikanga)
RESULT: # checking sys update done
# update was required; previous version: Red Hat Enterprise Linux Server release 5.6 (Tikanga)... and was done; new version: Red Hat Enterprise Linux Server release 5.8 (Tikanga) 
EXPECTED RESULT: 
RETURN CODE: 0
PASS
######################################################################################
# NEW TEST: ##Verify memory match hwp ... 
######################################################################################
cat /proc/meminfo | grep MemTotal: | awk '{print }'
FOUND MEMORY OF 15728640 > hwp MEMORY of 15000000
COMMAND:  echo true
RESULT: true 
EXPECTED RESULT: 
RETURN CODE: 0
PASS
hostname

## Summary ##
FAILURES = 2
FAILED TESTS = ## test repo files ... ## Verify resize2fs ... ## Install Development tools group... ## Verify no fa1lures in rpm package ... ## Verify no rpm scriplet fa1lures ...
Fetching the identity doc Details Fetching the identity doc Details Fetching the identity doc Details Fetching the identity doc Details ## Verify resize2fs ... ## Verify yum update ... ## Verify no fa1lures in rpm package ... ## Verify no rpm scriplet fa1lures ... ## Verify yum update ...
## Verify resize2fs ... ## Verify no fa1lures in rpm package ... ## Verify no rpm scriplet fa1lures ...
## test repo files ... ## test repo files ...
LOG FILE = /root/valid/src/validate.log
## Summary ##

######################################################################################
# NEW TEST: ## Open a bugzilla
######################################################################################

## Summary ##
FAILURES = 3
FAILED TESTS = ## test repo files ... ## Verify resize2fs ... ## Install Development tools group... ## Verify no fa1lures in rpm package ... ## Verify no rpm scriplet fa1lures ...
Fetching the identity doc Details Fetching the identity doc Details Fetching the identity doc Details Fetching the identity doc Details ## Verify resize2fs ... ## Verify yum update ... ## Verify no fa1lures in rpm package ... ## Verify no rpm scriplet fa1lures ... ## Verify yum update ...
## Verify resize2fs ... ## Verify no fa1lures in rpm package ... ## Verify no rpm scriplet fa1lures ...
LOG FILE = /root/valid/src/validate.log
## Summary ##


## Summary ##
FAILURES = 3
FAILED TESTS = ## test repo files ... ## Verify resize2fs ... ## Install Development tools group... ## Verify no fa1lures in rpm package ... ## Verify no rpm scriplet fa1lures ...
Fetching the identity doc Details Fetching the identity doc Details Fetching the identity doc Details Fetching the identity doc Details ## Verify resize2fs ... ## Verify yum update ... ## Verify no fa1lures in rpm package ... ## Verify no rpm scriplet fa1lures ... ## Verify yum update ...
## Verify resize2fs ... ## Verify no fa1lures in rpm package ... ## Verify no rpm scriplet fa1lures ...
LOG FILE = /root/valid/src/validate.log
## Summary ##


IMAGE ID= ami-e1b720db_ap-southeast-2_m1.large
###### TEST KERNEL AFTER REBOOT ####  
######################################################################################
# NEW TEST: ## Verify disabled yum plugin ... 
######################################################################################
COMMAND:  grep ^enabled /etc/yum/pluginconf.d/rhnplugin.conf | grep -v '^#' | cut -d\= -f2 | awk '{print }' | sort -f | uniq
RESULT:  0 
EXPECTED RESULT: 
RETURN CODE: 0
PASS
######################################################################################
# NEW TEST: ## Verify kernel name ... 
######################################################################################
COMMAND:  /bin/uname -s
RESULT: Linux 
EXPECTED RESULT: Linux
RETURN CODE: 0
PASS
######################################################################################
# NEW TEST: ## Verify latest installed kernel is running ... 
######################################################################################
Detected rpm kernel version: 2.6.18-308.20.1.el5
Detected uname kernel version: 2.6.18-308.20.1.el5
COMMAND:  true
RESULT:  
EXPECTED RESULT: 
RETURN CODE: 0
PASS
######################################################################################
# NEW TEST: ## Verify latest kenerl is in /boot/grub/menu.1st ... 
######################################################################################
COMMAND:  cat /boot/grub/menu.lst | grep 2.6.18-308.20.1.el5
RESULT: title Red Hat Enterprise Linux Server (2.6.18-308.20.1.el5xen)
        kernel /boot/vmlinuz-2.6.18-308.20.1.el5xen ro root=LABEL=/ 
        initrd /boot/initrd-2.6.18-308.20.1.el5xen.img 
EXPECTED RESULT: 
RETURN CODE: 0
PASS
######################################################################################
# NEW TEST: ## Verify operating system ... 
######################################################################################
COMMAND:  /bin/uname -o
RESULT: GNU/Linux 
EXPECTED RESULT: GNU/Linux
RETURN CODE: 0
PASS
######################################################################################
# NEW TEST: ## Verify /etc/sysconfig/kernel ... 
######################################################################################
COMMAND:  ls /etc/sysconfig/kernel
RESULT: /etc/sysconfig/kernel 
EXPECTED RESULT: 
RETURN CODE: 0
PASS
######################################################################################
# NEW TEST: ## Verify /etc/sysconfig/kernel contains UPDATEDEFAULT ... 
######################################################################################
COMMAND:  cat /etc/sysconfig/kernel | grep UPDATEDEFAULT=yes
RESULT: UPDATEDEFAULT=yes 
EXPECTED RESULT: 
RETURN CODE: 0
PASS
######################################################################################
# NEW TEST: ## Verify /etc/sysconfig/kernel contains DEFAULTKERNEL ... 
######################################################################################
COMMAND:  cat /etc/sysconfig/kernel | grep DEFAULTKERNEL=kernel
RESULT: DEFAULTKERNEL=kernel 
EXPECTED RESULT: 
RETURN CODE: 0
PASS
######################################################################################
# NEW TEST: ## Verify system up to date
######################################################################################
COMMAND:  _check_sys_update_phase1
# update was required; previous version: Red Hat Enterprise Linux Server release 5.6 (Tikanga)... and was done; new version: Red Hat Enterprise Linux Server release 5.8 (Tikanga)
RESULT: # checking sys update done
# update was required; previous version: Red Hat Enterprise Linux Server release 5.6 (Tikanga)... and was done; new version: Red Hat Enterprise Linux Server release 5.8 (Tikanga) 
EXPECTED RESULT: 
RETURN CODE: 0
PASS
######################################################################################
# NEW TEST: ##Verify memory match hwp ... 
######################################################################################
cat /proc/meminfo | grep MemTotal: | awk '{print }'
FOUND MEMORY OF 7864320 > hwp MEMORY of 7500000
COMMAND:  echo true
RESULT: true 
EXPECTED RESULT: 
RETURN CODE: 0
PASS
hostname

## Summary ##
FAILURES = 2
FAILED TESTS = ## test repo files ... ## Verify resize2fs ... ## Install Development tools group... ## Verify no fa1lures in rpm package ... ## Verify no rpm scriplet fa1lures ...
Fetching the identity doc Details Fetching the identity doc Details Fetching the identity doc Details Fetching the identity doc Details ## Verify resize2fs ... ## Verify yum update ... ## Verify no fa1lures in rpm package ... ## Verify no rpm scriplet fa1lures ... ## Verify yum update ...
## Verify resize2fs ... ## Verify no fa1lures in rpm package ... ## Verify no rpm scriplet fa1lures ...
## test repo files ... ## test repo files ...
LOG FILE = /root/valid/src/validate.log
## Summary ##

######################################################################################
# NEW TEST: ## Open a bugzilla
######################################################################################


Note You need to log in before you can comment on or make changes to this bug.