Bug 1668560 - heat_tempest_plugin.tests.scenario.test_aodh_alarm doesn't pass
Summary: heat_tempest_plugin.tests.scenario.test_aodh_alarm doesn't pass
Keywords:
Status: CLOSED ERRATA
Alias: None
Product: Red Hat OpenStack
Classification: Red Hat
Component: python-heat-tests-tempest
Version: 13.0 (Queens)
Hardware: Unspecified
OS: Unspecified
medium
medium
Target Milestone: z5
: 13.0 (Queens)
Assignee: Rabi Mishra
QA Contact: Arik Chernetsky
URL:
Whiteboard:
Depends On: 1651968
Blocks:
TreeView+ depends on / blocked
 
Reported: 2019-01-23 06:45 UTC by Chen
Modified: 2019-03-14 13:34 UTC (History)
1 user (show)

Fixed In Version: python-heat-tests-tempest-0.1.1-0.20180514163845.9d99219.el7ost
Doc Type: If docs needed, set a value
Doc Text:
Clone Of:
Environment:
Last Closed: 2019-03-14 13:34:20 UTC
Target Upstream Version:


Attachments (Terms of Use)


Links
System ID Private Priority Status Summary Last Updated
Red Hat Product Errata RHSA-2019:0564 0 None None None 2019-03-14 13:34:27 UTC

Description Chen 2019-01-23 06:45:34 UTC
Description of problem:

heat_tempest_plugin.tests.scenario.test_aodh_alarm doesn't pass

$ python -m testtools.run heat_tempest_plugin.tests.scenario.test_aodh_alarm.AodhAlarmTest.test_alarm
Tests running...
======================================================================
FAIL: heat_tempest_plugin.tests.scenario.test_aodh_alarm.AodhAlarmTest.test_alarm[id-fc0f18a6-f65c-4df1-b9c5-e160dea59849]
----------------------------------------------------------------------
pythonlogging:'': {{{
WARNING [heat_tempest_plugin.tests.scenario.test_aodh_alarm] check_instance_count exp:2, act:1
 WARNING [heat_tempest_plugin.tests.scenario.test_aodh_alarm] check_instance_count exp:2, act:1
 WARNING [heat_tempest_plugin.tests.scenario.test_aodh_alarm] check_instance_count exp:2, act:1
 WARNING [heat_tempest_plugin.tests.scenario.test_aodh_alarm] check_instance_count exp:2, act:1
 WARNING [heat_tempest_plugin.tests.scenario.test_aodh_alarm] check_instance_count exp:2, act:1
 WARNING [heat_tempest_plugin.tests.scenario.test_aodh_alarm] check_instance_count exp:2, act:1
 WARNING [heat_tempest_plugin.tests.scenario.test_aodh_alarm] check_instance_count exp:2, act:1
 WARNING [heat_tempest_plugin.tests.scenario.test_aodh_alarm] check_instance_count exp:2, act:1
 WARNING [heat_tempest_plugin.tests.scenario.test_aodh_alarm] check_instance_count exp:2, act:1
 WARNING [heat_tempest_plugin.tests.scenario.test_aodh_alarm] check_instance_count exp:2, act:1
 WARNING [heat_tempest_plugin.tests.scenario.test_aodh_alarm] check_instance_count exp:2, act:1
 WARNING [heat_tempest_plugin.tests.scenario.test_aodh_alarm] check_instance_count exp:2, act:1
 WARNING [heat_tempest_plugin.tests.scenario.test_aodh_alarm] check_instance_count exp:2, act:1
 WARNING [heat_tempest_plugin.tests.scenario.test_aodh_alarm] check_instance_count exp:2, act:1
 WARNING [heat_tempest_plugin.tests.scenario.test_aodh_alarm] check_instance_count exp:2, act:1
 WARNING [heat_tempest_plugin.tests.scenario.test_aodh_alarm] check_instance_count exp:2, act:1
 WARNING [heat_tempest_plugin.tests.scenario.test_aodh_alarm] check_instance_count exp:2, act:1
 WARNING [heat_tempest_plugin.tests.scenario.test_aodh_alarm] check_instance_count exp:2, act:1
 WARNING [heat_tempest_plugin.tests.scenario.test_aodh_alarm] check_instance_count exp:2, act:1
 WARNING [heat_tempest_plugin.tests.scenario.test_aodh_alarm] check_instance_count exp:2, act:1
 WARNING [heat_tempest_plugin.tests.scenario.test_aodh_alarm] check_instance_count exp:2, act:1
 WARNING [heat_tempest_plugin.tests.scenario.test_aodh_alarm] check_instance_count exp:2, act:1
 WARNING [heat_tempest_plugin.tests.scenario.test_aodh_alarm] check_instance_count exp:2, act:1
 WARNING [heat_tempest_plugin.tests.scenario.test_aodh_alarm] check_instance_count exp:2, act:1
 WARNING [heat_tempest_plugin.tests.scenario.test_aodh_alarm] check_instance_count exp:2, act:1
 WARNING [heat_tempest_plugin.tests.scenario.test_aodh_alarm] check_instance_count exp:2, act:1
 WARNING [heat_tempest_plugin.tests.scenario.test_aodh_alarm] check_instance_count exp:2, act:1
 WARNING [heat_tempest_plugin.tests.scenario.test_aodh_alarm] check_instance_count exp:2, act:1
 WARNING [heat_tempest_plugin.tests.scenario.test_aodh_alarm] check_instance_count exp:2, act:1
 WARNING [heat_tempest_plugin.tests.scenario.test_aodh_alarm] check_instance_count exp:2, act:1
 WARNING [heat_tempest_plugin.tests.scenario.test_aodh_alarm] check_instance_count exp:2, act:1
 WARNING [heat_tempest_plugin.tests.scenario.test_aodh_alarm] check_instance_count exp:2, act:1
 WARNING [heat_tempest_plugin.tests.scenario.test_aodh_alarm] check_instance_count exp:2, act:1
 WARNING [heat_tempest_plugin.tests.scenario.test_aodh_alarm] check_instance_count exp:2, act:1
 WARNING [heat_tempest_plugin.tests.scenario.test_aodh_alarm] check_instance_count exp:2, act:1
 WARNING [heat_tempest_plugin.tests.scenario.test_aodh_alarm] check_instance_count exp:2, act:1
 WARNING [heat_tempest_plugin.tests.scenario.test_aodh_alarm] check_instance_count exp:2, act:1
 WARNING [heat_tempest_plugin.tests.scenario.test_aodh_alarm] check_instance_count exp:2, act:1
 WARNING [heat_tempest_plugin.tests.scenario.test_aodh_alarm] check_instance_count exp:2, act:1
 WARNING [heat_tempest_plugin.tests.scenario.test_aodh_alarm] check_instance_count exp:2, act:1
 WARNING [heat_tempest_plugin.tests.scenario.test_aodh_alarm] check_instance_count exp:2, act:1
 WARNING [heat_tempest_plugin.tests.scenario.test_aodh_alarm] check_instance_count exp:2, act:1
 WARNING [heat_tempest_plugin.tests.scenario.test_aodh_alarm] check_instance_count exp:2, act:1
 WARNING [heat_tempest_plugin.tests.scenario.test_aodh_alarm] check_instance_count exp:2, act:1
 WARNING [heat_tempest_plugin.tests.scenario.test_aodh_alarm] check_instance_count exp:2, act:1
 WARNING [heat_tempest_plugin.tests.scenario.test_aodh_alarm] check_instance_count exp:2, act:1
 WARNING [heat_tempest_plugin.tests.scenario.test_aodh_alarm] check_instance_count exp:2, act:1
 WARNING [heat_tempest_plugin.tests.scenario.test_aodh_alarm] check_instance_count exp:2, act:1
 WARNING [heat_tempest_plugin.tests.scenario.test_aodh_alarm] check_instance_count exp:2, act:1
 WARNING [heat_tempest_plugin.tests.scenario.test_aodh_alarm] check_instance_count exp:2, act:1
 WARNING [heat_tempest_plugin.tests.scenario.test_aodh_alarm] check_instance_count exp:2, act:1
 WARNING [heat_tempest_plugin.tests.scenario.test_aodh_alarm] check_instance_count exp:2, act:1
 WARNING [heat_tempest_plugin.tests.scenario.test_aodh_alarm] check_instance_count exp:2, act:1
 WARNING [heat_tempest_plugin.tests.scenario.test_aodh_alarm] check_instance_count exp:2, act:1
 WARNING [heat_tempest_plugin.tests.scenario.test_aodh_alarm] check_instance_count exp:2, act:1
 WARNING [heat_tempest_plugin.tests.scenario.test_aodh_alarm] check_instance_count exp:2, act:1
 WARNING [heat_tempest_plugin.tests.scenario.test_aodh_alarm] check_instance_count exp:2, act:1
}}}

Traceback (most recent call last):
  File "/usr/lib/python2.7/site-packages/heat_tempest_plugin/tests/scenario/test_aodh_alarm.py", line 64, in test_alarm
    120, 2, self.check_instance_count, stack_identifier, 2))
  File "/usr/lib/python2.7/site-packages/unittest2/case.py", line 678, in assertTrue
    raise self.failureException(msg)
AssertionError: False is not true

Ran 1 test in 153.414s
FAILED (failures=1)


Version-Release number of selected component (if applicable):

OSP13

How reproducible:

100%

Steps to Reproduce:
1. Configure tempest environment
2. Assign _member_ role to demo user
3. Add [heat_plugin] section in tempest.conf

Actual results:

The tempest scenario test is failed

Expected results:

The test should pass

Additional info:

Comment 18 errata-xmlrpc 2019-03-14 13:34:20 UTC
Since the problem described in this bug report should be
resolved in a recent advisory, it has been closed with a
resolution of ERRATA.

For information on the advisory, and where to find the updated
files, follow the link below.

If the solution does not work for you, open a new bug report.

https://access.redhat.com/errata/RHSA-2019:0564


Note You need to log in before you can comment on or make changes to this bug.