Bug 434037 - eiciel failed massrebuild attempt for GCC 4.3
eiciel failed massrebuild attempt for GCC 4.3
Status: CLOSED DUPLICATE of bug 440894
Product: Fedora
Classification: Fedora
Component: eiciel (Show other bugs)
rawhide
All Linux
medium Severity medium
: ---
: ---
Assigned To: Chris Weyl
Fedora Extras Quality Assurance
:
Depends On:
Blocks: gcc43errors
  Show dependency treegraph
 
Reported: 2008-02-22 07:58 EST by Jesse Keating
Modified: 2013-01-09 21:50 EST (History)
2 users (show)

See Also:
Fixed In Version:
Doc Type: Bug Fix
Doc Text:
Story Points: ---
Clone Of:
Environment:
Last Closed: 2008-04-05 11:57:24 EDT
Type: ---
Regression: ---
Mount Type: ---
Documentation: ---
CRM:
Verified Versions:
Category: ---
oVirt Team: ---
RHEL 7.3 requirements from Atomic Host:


Attachments (Terms of Use)

  None (edit)
Description Jesse Keating 2008-02-22 07:58:10 EST
This is an automatically filed bug for a failed rebuild attempt for GCC 4.3.

http://fedoraproject.org/wiki/JesseKeating/gcc43MassRebuildProposal

Please verify why this build failed and fix it.
http://koji.fedoraproject.org/koji/taskinfo?taskID=437557
Exit code was 1, check the build.log for the failed buildArch task.
Comment 1 Jon Stanley 2008-02-23 16:13:37 EST
gestor_acl.cpp: In member function 'void GestorACL::obtenirPermisosUGO()':
gestor_acl.cpp:44: error: 'strerror' was not declared in this scope
gestor_acl.cpp: In member function 'void GestorACL::obtenirACLAccess()':
gestor_acl.cpp:113: error: 'strerror' was not declared in this scope
gestor_acl.cpp: In member function 'void GestorACL::aplicarCanvisAlFitxer()':
gestor_acl.cpp:555: error: 'strerror' was not declared in this scope
gestor_acl.cpp:563: error: 'strerror' was not declared in this scope
gestor_acl.cpp:578: error: 'strerror' was not declared in this scope
Comment 2 Denis Leroy 2008-04-05 11:57:24 EDT

*** This bug has been marked as a duplicate of 440894 ***

Note You need to log in before you can comment on or make changes to this bug.